{"text_format":"1","workbook":"xlsx","n_sheets":14,"sheets":["菜单","商品信息","供应商信息","客户信息","入库表","出库表","库存表","出入库单据","出入库存查询","应收明细","应付明细","数据统计","单据库","使用说明"],"not_rendered":{"charts":3,"images":4,"macros":1,"external_links":0,"defined_names":3,"comments":0,"pivot_tables":0},"unopened":[],"bounds":{"document_bytes":16777216,"sheet_cells":100000,"rows_first":2000,"rows_last":500,"rows_between":2000,"halvings":0,"cell_chars":16384,"cell_head_chars":4096},"cells_cut":0,"cells_raw":0,"read":"whole","date_system":"1900"}

{"sheet":"菜单","index":0,"n_rows":0,"n_cols":0,"rows_kept":0,"cut":false,"hidden":false,"merged":[[0,0,1,10],[13,0,14,10]]}

{"sheet":"商品信息","index":1,"n_rows":9,"n_cols":6,"rows_kept":9,"cut":false,"hidden":false,"merged":[[0,0,0,5]]}
["商品信息"]
["货品编码","货品名称","规格型号","单位","进货单价","供应商"]
["BM001","HPMC-001","GGXH-001","件",16,"深圳鸿达科技有限公司"]
["BM002","HPMC-002","GGXH-002","件",25,"广州鸿达科技有限公司"]
["BM003","HPMC-003","GGXH-003","件",36,"上海鸿达科技有限公司"]
["BM004","HPMC-004","GGXH-004","件",19,"北京鸿达科技有限公司"]
["BM005","HPMC-005","GGXH-005","件",29,"厦门鸿达科技有限公司"]
["BM006","HPMC-006","GGXH-006","件",37,"珠海鸿达科技有限公司"]
["BM007","HPMC-007","GGXH-007","件",30,"佛山鸿达科技有限公司"]

{"sheet":"供应商信息","index":2,"n_rows":9,"n_cols":9,"rows_kept":9,"cut":false,"hidden":false,"merged":[[0,0,0,8]]}
["供应商信息"]
["货品编码","货品名称","规格型号","单位","进货单价","供应商","供应商联系人","联系人电话","地址"]
["BM001","HPMC-001","GGXH-001","个",16,"深圳鸿达科技有限公司","张三",1001008611,"深圳"]
["BM002","HPMC-002","GGXH-002","个",25,"广州鸿达科技有限公司","李四",1001008612,"广州"]
["BM003","HPMC-003","GGXH-003","个",36,"上海鸿达科技有限公司","王五",1001008613,"上海"]
["BM004","HPMC-004","GGXH-004","个",19,"北京鸿达科技有限公司","赵六",1001008614,"北京"]
["BM005","HPMC-005","GGXH-005","个",29,"厦门鸿达科技有限公司","洪七",1001008615,"厦门"]
["BM006","HPMC-006","GGXH-006","个",37,"珠海鸿达科技有限公司","万八",1001008616,"珠海"]
["BM007","HPMC-007","GGXH-007","个",30,"佛山鸿达科技有限公司","汪九",1001008617,"佛山"]

{"sheet":"客户信息","index":3,"n_rows":9,"n_cols":6,"rows_kept":9,"cut":false,"hidden":false,"merged":[[0,0,0,5]]}
["客户信息"]
["序号","客户名称","联系人","联系电话","区域","业务范围"]
["01","深圳鸿达科技有限公司","张三",1001008611,"深圳","耐克春装"]
["02","广州鸿达科技有限公司","李四",1001008612,"广州","耐克夏装"]
["03","上海鸿达科技有限公司","王五",1001008613,"上海","耐克秋装"]
["04","北京鸿达科技有限公司","赵六",1001008614,"北京","耐克冬装"]
["05","厦门鸿达科技有限公司","洪七",1001008615,"厦门","特步春装"]
["06","珠海鸿达科技有限公司","万八",1001008616,"珠海","特步夏装"]
["07","佛山鸿达科技有限公司","汪九",1001008617,"佛山","特步秋装"]

{"sheet":"入库表","index":4,"n_rows":200,"n_cols":11,"rows_kept":200,"cut":false,"hidden":false,"merged":[[0,0,0,10]]}
["入库表"]
["采购日期","货品编码","货品名称","规格型号","颜    色","数    量","单    位","进货单价","金    额","实付金额","欠款金额"]
["2018-02-08","BM001",{"$f":"VLOOKUP(B3,商品信息!A:E,2,0)","v":"HPMC-001"},{"$f":"VLOOKUP(B3,商品信息!A:E,3,0)","v":"GGXH-001"},"红色",192,"件",16,{"$f":"F3*H3","v":3072},1500,{"$f":"I3-J3","v":1572}]
["2018-02-09","BM002",{"$f":"VLOOKUP(B4,商品信息!A:E,2,0)","v":"HPMC-002"},{"$f":"VLOOKUP(B4,商品信息!A:E,3,0)","v":"GGXH-002"},"蓝色",265,"件",25,{"$f":"F4*H4","v":6625},1500,{"$f":"I4-J4","v":5125}]
["2018-02-10","BM003",{"$f":"VLOOKUP(B5,商品信息!A:E,2,0)","v":"HPMC-003"},{"$f":"VLOOKUP(B5,商品信息!A:E,3,0)","v":"GGXH-003"},"黑色",165,"件",36,5940,1500,4440]
["2018-02-11","BM004",{"$f":"VLOOKUP(B6,商品信息!A:E,2,0)","v":"HPMC-004"},{"$f":"VLOOKUP(B6,商品信息!A:E,3,0)","v":"GGXH-004"},"黄色",98,"件",19,1862,1500,362]
["2018-02-12","BM005",{"$f":"VLOOKUP(B7,商品信息!A:E,2,0)","v":"HPMC-005"},{"$f":"VLOOKUP(B7,商品信息!A:E,3,0)","v":"GGXH-005"},"紫色",209,"件",29,6061,1500,4561]
["2018-02-13","BM006",{"$f":"VLOOKUP(B8,商品信息!A:E,2,0)","v":"HPMC-006"},{"$f":"VLOOKUP(B8,商品信息!A:E,3,0)","v":"GGXH-006"},"红色",350,"件",25,8750,1500,7250]
["2018-02-14","BM007",{"$f":"VLOOKUP(B9,商品信息!A:E,2,0)","v":"HPMC-007"},{"$f":"VLOOKUP(B9,商品信息!A:E,3,0)","v":"GGXH-007"},"橙色",189,"件",30,5670,1500,4170]
[null,null,null,null,null,null,null,null,0,null,0]
[null,null,null,null,null,null,null,null,0,null,0]
[null,null,null,null,null,null,null,null,0,null,0]
[null,null,null,null,null,null,null,null,0,null,0]
[null,null,null,null,null,null,null,null,0,null,0]
[null,null,null,null,null,null,null,null,0,null,0]
[null,null,null,null,null,null,null,null,0,null,0]
[null,null,null,null,null,null,null,null,0,null,0]
[null,null,null,null,null,null,null,null,0,null,0]
[null,null,null,null,null,null,null,null,0,null,0]
[null,null,null,null,null,null,null,null,0,null,0]
[null,null,null,null,null,null,null,null,0,null,0]
[null,null,null,null,null,null,null,null,0,null,0]
[null,null,null,null,null,null,null,null,0,null,0]
[null,null,null,null,null,null,null,null,0,null,0]
[null,null,null,null,null,null,null,null,0,null,0]
[null,null,null,null,null,null,null,null,0,null,0]
[null,null,null,null,null,null,null,null,0,null,0]
[null,null,null,null,null,null,null,null,0,null,0]
[null,null,null,null,null,null,null,null,0,null,0]
[null,null,null,null,null,null,null,null,0,null,0]
[null,null,null,null,null,null,null,null,0,null,0]
[null,null,null,null,null,null,null,null,0,null,0]
[null,null,null,null,null,null,null,null,0,null,0]
[null,null,null,null,null,null,null,null,0,null,0]
[null,null,null,null,null,null,null,null,0,null,0]
[null,null,null,null,null,null,null,null,0,null,0]
[null,null,null,null,null,null,null,null,0,null,0]
[null,null,null,null,null,null,null,null,0,null,0]
[null,null,null,null,null,null,null,null,0,null,0]
[null,null,null,null,null,null,null,null,0,null,0]
[null,null,null,null,null,null,null,null,0,null,0]
[null,null,null,null,null,null,null,null,0,null,0]
[null,null,null,null,null,null,null,null,0,null,0]
[null,null,null,null,null,null,null,null,0,null,0]
[null,null,null,null,null,null,null,null,0,null,0]
[null,null,null,null,null,null,null,null,0,null,0]
[null,null,null,null,null,null,null,null,0,null,0]
[null,null,null,null,null,null,null,null,0,null,0]
[null,null,null,null,null,null,null,null,0,null,0]
[null,null,null,null,null,null,null,null,0,null,0]
[null,null,null,null,null,null,null,null,0,null,0]
[null,null,null,null,null,null,null,null,0,null,0]
[null,null,null,null,null,null,null,null,0,null,0]
[null,null,null,null,null,null,null,null,0,null,0]
[null,null,null,null,null,null,null,null,0,null,0]
[null,null,null,null,null,null,null,null,0,null,0]
[null,null,null,null,null,null,null,null,0,null,0]
[null,null,null,null,null,null,null,null,0,null,0]
[null,null,null,null,null,null,null,null,0,null,0]
[null,null,null,null,null,null,null,null,0,null,0]
[null,null,null,null,null,null,null,null,0,null,0]
[null,null,null,null,null,null,null,null,0,null,0]
[null,null,null,null,null,null,null,null,0,null,0]
[null,null,null,null,null,null,null,null,0,null,0]
[null,null,null,null,null,null,null,null,0,null,0]
[null,null,null,null,null,null,null,null,0,null,0]
[null,null,null,null,null,null,null,null,0,null,0]
[null,null,null,null,null,null,null,null,{"$f":"F68*H68","v":0},null,{"$f":"I68-J68","v":0}]
[null,null,null,null,null,null,null,null,0,null,0]
[null,null,null,null,null,null,null,null,0,null,0]
[null,null,null,null,null,null,null,null,0,null,0]
[null,null,null,null,null,null,null,null,0,null,0]
[null,null,null,null,null,null,null,null,0,null,0]
[null,null,null,null,null,null,null,null,0,null,0]
[null,null,null,null,null,null,null,null,0,null,0]
[null,null,null,null,null,null,null,null,0,null,0]
[null,null,null,null,null,null,null,null,0,null,0]
[null,null,null,null,null,null,null,null,0,null,0]
[null,null,null,null,null,null,null,null,0,null,0]
[null,null,null,null,null,null,null,null,0,null,0]
[null,null,null,null,null,null,null,null,0,null,0]
[null,null,null,null,null,null,null,null,0,null,0]
[null,null,null,null,null,null,null,null,0,null,0]
[null,null,null,null,null,null,null,null,0,null,0]
[null,null,null,null,null,null,null,null,0,null,0]
[null,null,null,null,null,null,null,null,0,null,0]
[null,null,null,null,null,null,null,null,0,null,0]
[null,null,null,null,null,null,null,null,0,null,0]
[null,null,null,null,null,null,null,null,0,null,0]
[null,null,null,null,null,null,null,null,0,null,0]
[null,null,null,null,null,null,null,null,0,null,0]
[null,null,null,null,null,null,null,null,0,null,0]
[null,null,null,null,null,null,null,null,0,null,0]
[null,null,null,null,null,null,null,null,0,null,0]
[null,null,null,null,null,null,null,null,0,null,0]
[null,null,null,null,null,null,null,null,0,null,0]
[null,null,null,null,null,null,null,null,0,null,0]
[null,null,null,null,null,null,null,null,0,null,0]
[null,null,null,null,null,null,null,null,0,null,0]
[null,null,null,null,null,null,null,null,0,null,0]
[null,null,null,null,null,null,null,null,0,null,0]
[null,null,null,null,null,null,null,null,0,null,0]
[null,null,null,null,null,null,null,null,0,null,0]
[null,null,null,null,null,null,null,null,0,null,0]
[null,null,null,null,null,null,null,null,0,null,0]
[null,null,null,null,null,null,null,null,0,null,0]
[null,null,null,null,null,null,null,null,0,null,0]
[null,null,null,null,null,null,null,null,0,null,0]
[null,null,null,null,null,null,null,null,0,null,0]
[null,null,null,null,null,null,null,null,0,null,0]
[null,null,null,null,null,null,null,null,0,null,0]
[null,null,null,null,null,null,null,null,0,null,0]
[null,null,null,null,null,null,null,null,0,null,0]
[null,null,null,null,null,null,null,null,0,null,0]
[null,null,null,null,null,null,null,null,0,null,0]
[null,null,null,null,null,null,null,null,0,null,0]
[null,null,null,null,null,null,null,null,0,null,0]
[null,null,null,null,null,null,null,null,0,null,0]
[null,null,null,null,null,null,null,null,0,null,0]
[null,null,null,null,null,null,null,null,0,null,0]
[null,null,null,null,null,null,null,null,0,null,0]
[null,null,null,null,null,null,null,null,0,null,0]
[null,null,null,null,null,null,null,null,0,null,0]
[null,null,null,null,null,null,null,null,0,null,0]
[null,null,null,null,null,null,null,null,0,null,0]
[null,null,null,null,null,null,null,null,0,null,0]
[null,null,null,null,null,null,null,null,0,null,0]
[null,null,null,null,null,null,null,null,0,null,0]
[null,null,null,null,null,null,null,null,0,null,0]
[null,null,null,null,null,null,null,null,0,null,0]
[null,null,null,null,null,null,null,null,0,null,0]
[null,null,null,null,null,null,null,null,{"$f":"F132*H132","v":0},null,{"$f":"I132-J132","v":0}]
[null,null,null,null,null,null,null,null,0,null,0]
[null,null,null,null,null,null,null,null,0,null,0]
[null,null,null,null,null,null,null,null,0,null,0]
[null,null,null,null,null,null,null,null,0,null,0]
[null,null,null,null,null,null,null,null,0,null,0]
[null,null,null,null,null,null,null,null,0,null,0]
[null,null,null,null,null,null,null,null,0,null,0]
[null,null,null,null,null,null,null,null,0,null,0]
[null,null,null,null,null,null,null,null,0,null,0]
[null,null,null,null,null,null,null,null,0,null,0]
[null,null,null,null,null,null,null,null,0,null,0]
[null,null,null,null,null,null,null,null,0,null,0]
[null,null,null,null,null,null,null,null,0,null,0]
[null,null,null,null,null,null,null,null,0,null,0]
[null,null,null,null,null,null,null,null,0,null,0]
[null,null,null,null,null,null,null,null,0,null,0]
[null,null,null,null,null,null,null,null,0,null,0]
[null,null,null,null,null,null,null,null,0,null,0]
[null,null,null,null,null,null,null,null,0,null,0]
[null,null,null,null,null,null,null,null,0,null,0]
[null,null,null,null,null,null,null,null,0,null,0]
[null,null,null,null,null,null,null,null,0,null,0]
[null,null,null,null,null,null,null,null,0,null,0]
[null,null,null,null,null,null,null,null,0,null,0]
[null,null,null,null,null,null,null,null,0,null,0]
[null,null,null,null,null,null,null,null,0,null,0]
[null,null,null,null,null,null,null,null,0,null,0]
[null,null,null,null,null,null,null,null,0,null,0]
[null,null,null,null,null,null,null,null,0,null,0]
[null,null,null,null,null,null,null,null,0,null,0]
[null,null,null,null,null,null,null,null,0,null,0]
[null,null,null,null,null,null,null,null,0,null,0]
[null,null,null,null,null,null,null,null,0,null,0]
[null,null,null,null,null,null,null,null,0,null,0]
[null,null,null,null,null,null,null,null,0,null,0]
[null,null,null,null,null,null,null,null,0,null,0]
[null,null,null,null,null,null,null,null,0,null,0]
[null,null,null,null,null,null,null,null,0,null,0]
[null,null,null,null,null,null,null,null,0,null,0]
[null,null,null,null,null,null,null,null,0,null,0]
[null,null,null,null,null,null,null,null,0,null,0]
[null,null,null,null,null,null,null,null,0,null,0]
[null,null,null,null,null,null,null,null,0,null,0]
[null,null,null,null,null,null,null,null,0,null,0]
[null,null,null,null,null,null,null,null,0,null,0]
[null,null,null,null,null,null,null,null,0,null,0]
[null,null,null,null,null,null,null,null,0,null,0]
[null,null,null,null,null,null,null,null,0,null,0]
[null,null,null,null,null,null,null,null,0,null,0]
[null,null,null,null,null,null,null,null,0,null,0]
[null,null,null,null,null,null,null,null,0,null,0]
[null,null,null,null,null,null,null,null,0,null,0]
[null,null,null,null,null,null,null,null,0,null,0]
[null,null,null,null,null,null,null,null,0,null,0]
[null,null,null,null,null,null,null,null,0,null,0]
[null,null,null,null,null,null,null,null,0,null,0]
[null,null,null,null,null,null,null,null,0,null,0]
[null,null,null,null,null,null,null,null,0,null,0]
[null,null,null,null,null,null,null,null,0,null,0]
[null,null,null,null,null,null,null,null,0,null,0]
[null,null,null,null,null,null,null,null,0,null,0]
[null,null,null,null,null,null,null,null,0,null,0]
[null,null,null,null,null,null,null,null,0,null,0]
[null,null,null,null,null,null,null,null,{"$f":"F196*H196","v":0},null,{"$f":"I196-J196","v":0}]
[null,null,null,null,null,null,null,null,0,null,0]
[null,null,null,null,null,null,null,null,0,null,0]
[null,null,null,null,null,null,null,null,0,null,0]
[null,null,null,null,null,null,null,null,0,null,0]

{"sheet":"出库表","index":5,"n_rows":200,"n_cols":11,"rows_kept":200,"cut":false,"hidden":false,"merged":[[0,0,0,10]]}
["出库表"]
["销售日期","货品编码","货品名称","规格型号","颜    色","数    量","单    位","销售单价","金    额","实收金额","欠收款金额"]
["2018-02-20","BM001",{"$f":"VLOOKUP(B3,商品信息!A:E,2,0)","v":"HPMC-001"},{"$f":"VLOOKUP(B3,商品信息!A:E,3,0)","v":"GGXH-001"},"红色",65,"件",25,{"$f":"H3*F3","v":1625},100,{"$f":"I3-J3","v":1525}]
["2018-02-21","BM002",{"$f":"VLOOKUP(B4,商品信息!A:E,2,0)","v":"HPMC-002"},{"$f":"VLOOKUP(B4,商品信息!A:E,3,0)","v":"GGXH-002"},"蓝色",192,"件",37,{"$f":"H4*F4","v":7104},100,{"$f":"I4-J4","v":7004}]
["2018-02-22","BM003",{"$f":"VLOOKUP(B5,商品信息!A:E,2,0)","v":"HPMC-003"},{"$f":"VLOOKUP(B5,商品信息!A:E,3,0)","v":"GGXH-003"},"黑色",108,"件",45,4860,100,4760]
["2018-02-23","BM004",{"$f":"VLOOKUP(B6,商品信息!A:E,2,0)","v":"HPMC-004"},{"$f":"VLOOKUP(B6,商品信息!A:E,3,0)","v":"GGXH-004"},"黄色",37,"件",30,1110,100,1010]
["2018-02-24","BM005",{"$f":"VLOOKUP(B7,商品信息!A:E,2,0)","v":"HPMC-005"},{"$f":"VLOOKUP(B7,商品信息!A:E,3,0)","v":"GGXH-005"},"紫色",163,"件",41,6683,100,6583]
["2018-02-25","BM006",{"$f":"VLOOKUP(B8,商品信息!A:E,2,0)","v":"HPMC-006"},{"$f":"VLOOKUP(B8,商品信息!A:E,3,0)","v":"GGXH-006"},"金色",295,"件",53,15635,10000,5635]
["2018-02-26","BM007",{"$f":"VLOOKUP(B9,商品信息!A:E,2,0)","v":"HPMC-007"},{"$f":"VLOOKUP(B9,商品信息!A:E,3,0)","v":"GGXH-007"},"橙色",118,"件",45,5310,1000,4310]
[null,null,null,null,null,null,null,null,0,null,0]
[null,null,null,null,null,null,null,null,0,null,0]
[null,null,null,null,null,null,null,null,0,null,0]
[null,null,null,null,null,null,null,null,0,null,0]
[null,null,null,null,null,null,null,null,0,null,0]
[null,null,null,null,null,null,null,null,0,null,0]
[null,null,null,null,null,null,null,null,0,null,0]
[null,null,null,null,null,null,null,null,0,null,0]
[null,null,null,null,null,null,null,null,0,null,0]
[null,null,null,null,null,null,null,null,0,null,0]
[null,null,null,null,null,null,null,null,0,null,0]
[null,null,null,null,null,null,null,null,0,null,0]
[null,null,null,null,null,null,null,null,0,null,0]
[null,null,null,null,null,null,null,null,0,null,0]
[null,null,null,null,null,null,null,null,0,null,0]
[null,null,null,null,null,null,null,null,0,null,0]
[null,null,null,null,null,null,null,null,0,null,0]
[null,null,null,null,null,null,null,null,0,null,0]
[null,null,null,null,null,null,null,null,0,null,0]
[null,null,null,null,null,null,null,null,0,null,0]
[null,null,null,null,null,null,null,null,0,null,0]
[null,null,null,null,null,null,null,null,0,null,0]
[null,null,null,null,null,null,null,null,0,null,0]
[null,null,null,null,null,null,null,null,0,null,0]
[null,null,null,null,null,null,null,null,0,null,0]
[null,null,null,null,null,null,null,null,0,null,0]
[null,null,null,null,null,null,null,null,0,null,0]
[null,null,null,null,null,null,null,null,0,null,0]
[null,null,null,null,null,null,null,null,0,null,0]
[null,null,null,null,null,null,null,null,0,null,0]
[null,null,null,null,null,null,null,null,0,null,0]
[null,null,null,null,null,null,null,null,0,null,0]
[null,null,null,null,null,null,null,null,0,null,0]
[null,null,null,null,null,null,null,null,0,null,0]
[null,null,null,null,null,null,null,null,0,null,0]
[null,null,null,null,null,null,null,null,0,null,0]
[null,null,null,null,null,null,null,null,0,null,0]
[null,null,null,null,null,null,null,null,0,null,0]
[null,null,null,null,null,null,null,null,0,null,0]
[null,null,null,null,null,null,null,null,0,null,0]
[null,null,null,null,null,null,null,null,0,null,0]
[null,null,null,null,null,null,null,null,0,null,0]
[null,null,null,null,null,null,null,null,0,null,0]
[null,null,null,null,null,null,null,null,0,null,0]
[null,null,null,null,null,null,null,null,0,null,0]
[null,null,null,null,null,null,null,null,0,null,0]
[null,null,null,null,null,null,null,null,0,null,0]
[null,null,null,null,null,null,null,null,0,null,0]
[null,null,null,null,null,null,null,null,0,null,0]
[null,null,null,null,null,null,null,null,0,null,0]
[null,null,null,null,null,null,null,null,0,null,0]
[null,null,null,null,null,null,null,null,0,null,0]
[null,null,null,null,null,null,null,null,0,null,0]
[null,null,null,null,null,null,null,null,0,null,0]
[null,null,null,null,null,null,null,null,0,null,0]
[null,null,null,null,null,null,null,null,0,null,0]
[null,null,null,null,null,null,null,null,0,null,0]
[null,null,null,null,null,null,null,null,0,null,0]
[null,null,null,null,null,null,null,null,{"$f":"H68*F68","v":0},null,{"$f":"I68-J68","v":0}]
[null,null,null,null,null,null,null,null,0,null,0]
[null,null,null,null,null,null,null,null,0,null,0]
[null,null,null,null,null,null,null,null,0,null,0]
[null,null,null,null,null,null,null,null,0,null,0]
[null,null,null,null,null,null,null,null,0,null,0]
[null,null,null,null,null,null,null,null,0,null,0]
[null,null,null,null,null,null,null,null,0,null,0]
[null,null,null,null,null,null,null,null,0,null,0]
[null,null,null,null,null,null,null,null,0,null,0]
[null,null,null,null,null,null,null,null,0,null,0]
[null,null,null,null,null,null,null,null,0,null,0]
[null,null,null,null,null,null,null,null,0,null,0]
[null,null,null,null,null,null,null,null,0,null,0]
[null,null,null,null,null,null,null,null,0,null,0]
[null,null,null,null,null,null,null,null,0,null,0]
[null,null,null,null,null,null,null,null,0,null,0]
[null,null,null,null,null,null,null,null,0,null,0]
[null,null,null,null,null,null,null,null,0,null,0]
[null,null,null,null,null,null,null,null,0,null,0]
[null,null,null,null,null,null,null,null,0,null,0]
[null,null,null,null,null,null,null,null,0,null,0]
[null,null,null,null,null,null,null,null,0,null,0]
[null,null,null,null,null,null,null,null,0,null,0]
[null,null,null,null,null,null,null,null,0,null,0]
[null,null,null,null,null,null,null,null,0,null,0]
[null,null,null,null,null,null,null,null,0,null,0]
[null,null,null,null,null,null,null,null,0,null,0]
[null,null,null,null,null,null,null,null,0,null,0]
[null,null,null,null,null,null,null,null,0,null,0]
[null,null,null,null,null,null,null,null,0,null,0]
[null,null,null,null,null,null,null,null,0,null,0]
[null,null,null,null,null,null,null,null,0,null,0]
[null,null,null,null,null,null,null,null,0,null,0]
[null,null,null,null,null,null,null,null,0,null,0]
[null,null,null,null,null,null,null,null,0,null,0]
[null,null,null,null,null,null,null,null,0,null,0]
[null,null,null,null,null,null,null,null,0,null,0]
[null,null,null,null,null,null,null,null,0,null,0]
[null,null,null,null,null,null,null,null,0,null,0]
[null,null,null,null,null,null,null,null,0,null,0]
[null,null,null,null,null,null,null,null,0,null,0]
[null,null,null,null,null,null,null,null,0,null,0]
[null,null,null,null,null,null,null,null,0,null,0]
[null,null,null,null,null,null,null,null,0,null,0]
[null,null,null,null,null,null,null,null,0,null,0]
[null,null,null,null,null,null,null,null,0,null,0]
[null,null,null,null,null,null,null,null,0,null,0]
[null,null,null,null,null,null,null,null,0,null,0]
[null,null,null,null,null,null,null,null,0,null,0]
[null,null,null,null,null,null,null,null,0,null,0]
[null,null,null,null,null,null,null,null,0,null,0]
[null,null,null,null,null,null,null,null,0,null,0]
[null,null,null,null,null,null,null,null,0,null,0]
[null,null,null,null,null,null,null,null,0,null,0]
[null,null,null,null,null,null,null,null,0,null,0]
[null,null,null,null,null,null,null,null,0,null,0]
[null,null,null,null,null,null,null,null,0,null,0]
[null,null,null,null,null,null,null,null,0,null,0]
[null,null,null,null,null,null,null,null,0,null,0]
[null,null,null,null,null,null,null,null,0,null,0]
[null,null,null,null,null,null,null,null,0,null,0]
[null,null,null,null,null,null,null,null,0,null,0]
[null,null,null,null,null,null,null,null,0,null,0]
[null,null,null,null,null,null,null,null,{"$f":"H132*F132","v":0},null,{"$f":"I132-J132","v":0}]
[null,null,null,null,null,null,null,null,0,null,0]
[null,null,null,null,null,null,null,null,0,null,0]
[null,null,null,null,null,null,null,null,0,null,0]
[null,null,null,null,null,null,null,null,0,null,0]
[null,null,null,null,null,null,null,null,0,null,0]
[null,null,null,null,null,null,null,null,0,null,0]
[null,null,null,null,null,null,null,null,0,null,0]
[null,null,null,null,null,null,null,null,0,null,0]
[null,null,null,null,null,null,null,null,0,null,0]
[null,null,null,null,null,null,null,null,0,null,0]
[null,null,null,null,null,null,null,null,0,null,0]
[null,null,null,null,null,null,null,null,0,null,0]
[null,null,null,null,null,null,null,null,0,null,0]
[null,null,null,null,null,null,null,null,0,null,0]
[null,null,null,null,null,null,null,null,0,null,0]
[null,null,null,null,null,null,null,null,0,null,0]
[null,null,null,null,null,null,null,null,0,null,0]
[null,null,null,null,null,null,null,null,0,null,0]
[null,null,null,null,null,null,null,null,0,null,0]
[null,null,null,null,null,null,null,null,0,null,0]
[null,null,null,null,null,null,null,null,0,null,0]
[null,null,null,null,null,null,null,null,0,null,0]
[null,null,null,null,null,null,null,null,0,null,0]
[null,null,null,null,null,null,null,null,0,null,0]
[null,null,null,null,null,null,null,null,0,null,0]
[null,null,null,null,null,null,null,null,0,null,0]
[null,null,null,null,null,null,null,null,0,null,0]
[null,null,null,null,null,null,null,null,0,null,0]
[null,null,null,null,null,null,null,null,0,null,0]
[null,null,null,null,null,null,null,null,0,null,0]
[null,null,null,null,null,null,null,null,0,null,0]
[null,null,null,null,null,null,null,null,0,null,0]
[null,null,null,null,null,null,null,null,0,null,0]
[null,null,null,null,null,null,null,null,0,null,0]
[null,null,null,null,null,null,null,null,0,null,0]
[null,null,null,null,null,null,null,null,0,null,0]
[null,null,null,null,null,null,null,null,0,null,0]
[null,null,null,null,null,null,null,null,0,null,0]
[null,null,null,null,null,null,null,null,0,null,0]
[null,null,null,null,null,null,null,null,0,null,0]
[null,null,null,null,null,null,null,null,0,null,0]
[null,null,null,null,null,null,null,null,0,null,0]
[null,null,null,null,null,null,null,null,0,null,0]
[null,null,null,null,null,null,null,null,0,null,0]
[null,null,null,null,null,null,null,null,0,null,0]
[null,null,null,null,null,null,null,null,0,null,0]
[null,null,null,null,null,null,null,null,0,null,0]
[null,null,null,null,null,null,null,null,0,null,0]
[null,null,null,null,null,null,null,null,0,null,0]
[null,null,null,null,null,null,null,null,0,null,0]
[null,null,null,null,null,null,null,null,0,null,0]
[null,null,null,null,null,null,null,null,0,null,0]
[null,null,null,null,null,null,null,null,0,null,0]
[null,null,null,null,null,null,null,null,0,null,0]
[null,null,null,null,null,null,null,null,0,null,0]
[null,null,null,null,null,null,null,null,0,null,0]
[null,null,null,null,null,null,null,null,0,null,0]
[null,null,null,null,null,null,null,null,0,null,0]
[null,null,null,null,null,null,null,null,0,null,0]
[null,null,null,null,null,null,null,null,0,null,0]
[null,null,null,null,null,null,null,null,0,null,0]
[null,null,null,null,null,null,null,null,0,null,0]
[null,null,null,null,null,null,null,null,0,null,0]
[null,null,null,null,null,null,null,null,{"$f":"H196*F196","v":0},null,{"$f":"I196-J196","v":0}]
[null,null,null,null,null,null,null,null,0,null,0]
[null,null,null,null,null,null,null,null,0,null,0]
[null,null,null,null,null,null,null,null,0,null,0]
[null,null,null,null,null,null,null,null,0,null,0]

{"sheet":"库存表","index":6,"n_rows":200,"n_cols":13,"rows_kept":200,"cut":false,"hidden":false,"merged":[[0,0,0,12]]}
["库存表"]
["货品编码","货品名称","规格型号","颜    色","单    位","入库数量","进货单价","金    额","出库数量","销售单价","金    额","库存数量","利润"]
["BM001",{"$f":"VLOOKUP(A3,商品信息!A:E,2,0)","v":"HPMC-001"},{"$f":"VLOOKUP(A3,商品信息!A:E,3,0)","v":"GGXH-001"},"红色","件",{"$f":"VLOOKUP(A3,入库表!B:H,5,0)","v":192},{"$f":"VLOOKUP(A3,入库表!B:H,7,0)","v":16},{"$f":"F3*G3","v":3072},66,{"$f":"VLOOKUP(A3,出库表!B:H,7,0)","v":25},{"$f":"I3*J3","v":1650},{"$f":"F3-I3","v":126},{"$f":"I3*(J3-G3)","v":594}]
["BM002",{"$f":"VLOOKUP(A4,商品信息!A:E,2,0)","v":"HPMC-002"},{"$f":"VLOOKUP(A4,商品信息!A:E,3,0)","v":"GGXH-002"},"蓝色","件",{"$f":"VLOOKUP(A4,入库表!B:H,5,0)","v":265},{"$f":"VLOOKUP(A4,入库表!B:H,7,0)","v":25},6625,{"$f":"VLOOKUP(A4,出库表!B:H,5,0)","v":192},{"$f":"VLOOKUP(A4,出库表!B:H,7,0)","v":37},{"$f":"I4*J4","v":7104},{"$f":"F4-I4","v":73},{"$f":"I4*(J4-G4)","v":2304}]
["BM003",{"$f":"VLOOKUP(A5,商品信息!A:E,2,0)","v":"HPMC-003"},{"$f":"VLOOKUP(A5,商品信息!A:E,3,0)","v":"GGXH-003"},"黑色","件",{"$f":"VLOOKUP(A5,入库表!B:H,5,0)","v":165},{"$f":"VLOOKUP(A5,入库表!B:H,7,0)","v":36},5940,{"$f":"VLOOKUP(A5,出库表!B:H,5,0)","v":108},{"$f":"VLOOKUP(A5,出库表!B:H,7,0)","v":45},4860,57,972]
["BM004",{"$f":"VLOOKUP(A6,商品信息!A:E,2,0)","v":"HPMC-004"},{"$f":"VLOOKUP(A6,商品信息!A:E,3,0)","v":"GGXH-004"},"黄色","件",{"$f":"VLOOKUP(A6,入库表!B:H,5,0)","v":98},{"$f":"VLOOKUP(A6,入库表!B:H,7,0)","v":19},1862,{"$f":"VLOOKUP(A6,出库表!B:H,5,0)","v":37},{"$f":"VLOOKUP(A6,出库表!B:H,7,0)","v":30},1110,61,407]
["BM005",{"$f":"VLOOKUP(A7,商品信息!A:E,2,0)","v":"HPMC-005"},{"$f":"VLOOKUP(A7,商品信息!A:E,3,0)","v":"GGXH-005"},"紫色","件",{"$f":"VLOOKUP(A7,入库表!B:H,5,0)","v":209},{"$f":"VLOOKUP(A7,入库表!B:H,7,0)","v":29},6061,{"$f":"VLOOKUP(A7,出库表!B:H,5,0)","v":163},{"$f":"VLOOKUP(A7,出库表!B:H,7,0)","v":41},6683,46,1956]
["BM006",{"$f":"VLOOKUP(A8,商品信息!A:E,2,0)","v":"HPMC-006"},{"$f":"VLOOKUP(A8,商品信息!A:E,3,0)","v":"GGXH-006"},"红色","件",{"$f":"VLOOKUP(A8,入库表!B:H,5,0)","v":350},{"$f":"VLOOKUP(A8,入库表!B:H,7,0)","v":25},8750,{"$f":"VLOOKUP(A8,出库表!B:H,5,0)","v":295},{"$f":"VLOOKUP(A8,出库表!B:H,7,0)","v":53},15635,55,8260]
["BM007",{"$f":"VLOOKUP(A9,商品信息!A:E,2,0)","v":"HPMC-007"},{"$f":"VLOOKUP(A9,商品信息!A:E,3,0)","v":"GGXH-007"},"橙色","件",{"$f":"VLOOKUP(A9,入库表!B:H,5,0)","v":189},{"$f":"VLOOKUP(A9,入库表!B:H,7,0)","v":30},5670,{"$f":"VLOOKUP(A9,出库表!B:H,5,0)","v":118},{"$f":"VLOOKUP(A9,出库表!B:H,7,0)","v":45},5310,71,1770]
[null,{"$f":"VLOOKUP(A10,商品信息!A:E,2,0)","v":{"$error":"#N/A"}},{"$f":"VLOOKUP(A10,商品信息!A:E,3,0)","v":{"$error":"#N/A"}},null,null,{"$f":"VLOOKUP(A10,入库表!B:H,5,0)","v":{"$error":"#N/A"}},{"$f":"VLOOKUP(A10,入库表!B:H,7,0)","v":{"$error":"#N/A"}},{"$error":"#N/A"},{"$f":"VLOOKUP(A10,出库表!B:H,5,0)","v":{"$error":"#N/A"}},{"$f":"VLOOKUP(A10,出库表!B:H,7,0)","v":{"$error":"#N/A"}},{"$error":"#N/A"},{"$error":"#N/A"},{"$error":"#N/A"}]
[null,{"$f":"VLOOKUP(A11,商品信息!A:E,2,0)","v":{"$error":"#N/A"}},{"$f":"VLOOKUP(A11,商品信息!A:E,3,0)","v":{"$error":"#N/A"}},null,null,{"$f":"VLOOKUP(A11,入库表!B:H,5,0)","v":{"$error":"#N/A"}},{"$f":"VLOOKUP(A11,入库表!B:H,7,0)","v":{"$error":"#N/A"}},{"$error":"#N/A"},{"$f":"VLOOKUP(A11,出库表!B:H,5,0)","v":{"$error":"#N/A"}},{"$f":"VLOOKUP(A11,出库表!B:H,7,0)","v":{"$error":"#N/A"}},{"$error":"#N/A"},{"$error":"#N/A"},{"$error":"#N/A"}]
[null,{"$f":"VLOOKUP(A12,商品信息!A:E,2,0)","v":{"$error":"#N/A"}},{"$f":"VLOOKUP(A12,商品信息!A:E,3,0)","v":{"$error":"#N/A"}},null,null,{"$f":"VLOOKUP(A12,入库表!B:H,5,0)","v":{"$error":"#N/A"}},{"$f":"VLOOKUP(A12,入库表!B:H,7,0)","v":{"$error":"#N/A"}},{"$error":"#N/A"},{"$f":"VLOOKUP(A12,出库表!B:H,5,0)","v":{"$error":"#N/A"}},{"$f":"VLOOKUP(A12,出库表!B:H,7,0)","v":{"$error":"#N/A"}},{"$error":"#N/A"},{"$error":"#N/A"},{"$error":"#N/A"}]
[null,{"$f":"VLOOKUP(A13,商品信息!A:E,2,0)","v":{"$error":"#N/A"}},{"$f":"VLOOKUP(A13,商品信息!A:E,3,0)","v":{"$error":"#N/A"}},null,null,{"$f":"VLOOKUP(A13,入库表!B:H,5,0)","v":{"$error":"#N/A"}},{"$f":"VLOOKUP(A13,入库表!B:H,7,0)","v":{"$error":"#N/A"}},{"$error":"#N/A"},{"$f":"VLOOKUP(A13,出库表!B:H,5,0)","v":{"$error":"#N/A"}},{"$f":"VLOOKUP(A13,出库表!B:H,7,0)","v":{"$error":"#N/A"}},{"$error":"#N/A"},{"$error":"#N/A"},{"$error":"#N/A"}]
[null,{"$f":"VLOOKUP(A14,商品信息!A:E,2,0)","v":{"$error":"#N/A"}},{"$f":"VLOOKUP(A14,商品信息!A:E,3,0)","v":{"$error":"#N/A"}},null,null,{"$f":"VLOOKUP(A14,入库表!B:H,5,0)","v":{"$error":"#N/A"}},{"$f":"VLOOKUP(A14,入库表!B:H,7,0)","v":{"$error":"#N/A"}},{"$error":"#N/A"},{"$f":"VLOOKUP(A14,出库表!B:H,5,0)","v":{"$error":"#N/A"}},{"$f":"VLOOKUP(A14,出库表!B:H,7,0)","v":{"$error":"#N/A"}},{"$error":"#N/A"},{"$error":"#N/A"},{"$error":"#N/A"}]
[null,{"$f":"VLOOKUP(A15,商品信息!A:E,2,0)","v":{"$error":"#N/A"}},{"$f":"VLOOKUP(A15,商品信息!A:E,3,0)","v":{"$error":"#N/A"}},null,null,{"$f":"VLOOKUP(A15,入库表!B:H,5,0)","v":{"$error":"#N/A"}},{"$f":"VLOOKUP(A15,入库表!B:H,7,0)","v":{"$error":"#N/A"}},{"$error":"#N/A"},{"$f":"VLOOKUP(A15,出库表!B:H,5,0)","v":{"$error":"#N/A"}},{"$f":"VLOOKUP(A15,出库表!B:H,7,0)","v":{"$error":"#N/A"}},{"$error":"#N/A"},{"$error":"#N/A"},{"$error":"#N/A"}]
[null,{"$f":"VLOOKUP(A16,商品信息!A:E,2,0)","v":{"$error":"#N/A"}},{"$f":"VLOOKUP(A16,商品信息!A:E,3,0)","v":{"$error":"#N/A"}},null,null,{"$f":"VLOOKUP(A16,入库表!B:H,5,0)","v":{"$error":"#N/A"}},{"$f":"VLOOKUP(A16,入库表!B:H,7,0)","v":{"$error":"#N/A"}},{"$error":"#N/A"},{"$f":"VLOOKUP(A16,出库表!B:H,5,0)","v":{"$error":"#N/A"}},{"$f":"VLOOKUP(A16,出库表!B:H,7,0)","v":{"$error":"#N/A"}},{"$error":"#N/A"},{"$error":"#N/A"},{"$error":"#N/A"}]
[null,{"$f":"VLOOKUP(A17,商品信息!A:E,2,0)","v":{"$error":"#N/A"}},{"$f":"VLOOKUP(A17,商品信息!A:E,3,0)","v":{"$error":"#N/A"}},null,null,{"$f":"VLOOKUP(A17,入库表!B:H,5,0)","v":{"$error":"#N/A"}},{"$f":"VLOOKUP(A17,入库表!B:H,7,0)","v":{"$error":"#N/A"}},{"$error":"#N/A"},{"$f":"VLOOKUP(A17,出库表!B:H,5,0)","v":{"$error":"#N/A"}},{"$f":"VLOOKUP(A17,出库表!B:H,7,0)","v":{"$error":"#N/A"}},{"$error":"#N/A"},{"$error":"#N/A"},{"$error":"#N/A"}]
[null,{"$f":"VLOOKUP(A18,商品信息!A:E,2,0)","v":{"$error":"#N/A"}},{"$f":"VLOOKUP(A18,商品信息!A:E,3,0)","v":{"$error":"#N/A"}},null,null,{"$f":"VLOOKUP(A18,入库表!B:H,5,0)","v":{"$error":"#N/A"}},{"$f":"VLOOKUP(A18,入库表!B:H,7,0)","v":{"$error":"#N/A"}},{"$error":"#N/A"},{"$f":"VLOOKUP(A18,出库表!B:H,5,0)","v":{"$error":"#N/A"}},{"$f":"VLOOKUP(A18,出库表!B:H,7,0)","v":{"$error":"#N/A"}},{"$error":"#N/A"},{"$error":"#N/A"},{"$error":"#N/A"}]
[null,{"$f":"VLOOKUP(A19,商品信息!A:E,2,0)","v":{"$error":"#N/A"}},{"$f":"VLOOKUP(A19,商品信息!A:E,3,0)","v":{"$error":"#N/A"}},null,null,{"$f":"VLOOKUP(A19,入库表!B:H,5,0)","v":{"$error":"#N/A"}},{"$f":"VLOOKUP(A19,入库表!B:H,7,0)","v":{"$error":"#N/A"}},{"$error":"#N/A"},{"$f":"VLOOKUP(A19,出库表!B:H,5,0)","v":{"$error":"#N/A"}},{"$f":"VLOOKUP(A19,出库表!B:H,7,0)","v":{"$error":"#N/A"}},{"$error":"#N/A"},{"$error":"#N/A"},{"$error":"#N/A"}]
[null,{"$f":"VLOOKUP(A20,商品信息!A:E,2,0)","v":{"$error":"#N/A"}},{"$f":"VLOOKUP(A20,商品信息!A:E,3,0)","v":{"$error":"#N/A"}},null,null,{"$f":"VLOOKUP(A20,入库表!B:H,5,0)","v":{"$error":"#N/A"}},{"$f":"VLOOKUP(A20,入库表!B:H,7,0)","v":{"$error":"#N/A"}},{"$error":"#N/A"},{"$f":"VLOOKUP(A20,出库表!B:H,5,0)","v":{"$error":"#N/A"}},{"$f":"VLOOKUP(A20,出库表!B:H,7,0)","v":{"$error":"#N/A"}},{"$error":"#N/A"},{"$error":"#N/A"},{"$error":"#N/A"}]
[null,{"$f":"VLOOKUP(A21,商品信息!A:E,2,0)","v":{"$error":"#N/A"}},{"$f":"VLOOKUP(A21,商品信息!A:E,3,0)","v":{"$error":"#N/A"}},null,null,{"$f":"VLOOKUP(A21,入库表!B:H,5,0)","v":{"$error":"#N/A"}},{"$f":"VLOOKUP(A21,入库表!B:H,7,0)","v":{"$error":"#N/A"}},{"$error":"#N/A"},{"$f":"VLOOKUP(A21,出库表!B:H,5,0)","v":{"$error":"#N/A"}},{"$f":"VLOOKUP(A21,出库表!B:H,7,0)","v":{"$error":"#N/A"}},{"$error":"#N/A"},{"$error":"#N/A"},{"$error":"#N/A"}]
[null,{"$f":"VLOOKUP(A22,商品信息!A:E,2,0)","v":{"$error":"#N/A"}},{"$f":"VLOOKUP(A22,商品信息!A:E,3,0)","v":{"$error":"#N/A"}},null,null,{"$f":"VLOOKUP(A22,入库表!B:H,5,0)","v":{"$error":"#N/A"}},{"$f":"VLOOKUP(A22,入库表!B:H,7,0)","v":{"$error":"#N/A"}},{"$error":"#N/A"},{"$f":"VLOOKUP(A22,出库表!B:H,5,0)","v":{"$error":"#N/A"}},{"$f":"VLOOKUP(A22,出库表!B:H,7,0)","v":{"$error":"#N/A"}},{"$error":"#N/A"},{"$error":"#N/A"},{"$error":"#N/A"}]
[null,{"$f":"VLOOKUP(A23,商品信息!A:E,2,0)","v":{"$error":"#N/A"}},{"$f":"VLOOKUP(A23,商品信息!A:E,3,0)","v":{"$error":"#N/A"}},null,null,{"$f":"VLOOKUP(A23,入库表!B:H,5,0)","v":{"$error":"#N/A"}},{"$f":"VLOOKUP(A23,入库表!B:H,7,0)","v":{"$error":"#N/A"}},{"$error":"#N/A"},{"$f":"VLOOKUP(A23,出库表!B:H,5,0)","v":{"$error":"#N/A"}},{"$f":"VLOOKUP(A23,出库表!B:H,7,0)","v":{"$error":"#N/A"}},{"$error":"#N/A"},{"$error":"#N/A"},{"$error":"#N/A"}]
[null,{"$f":"VLOOKUP(A24,商品信息!A:E,2,0)","v":{"$error":"#N/A"}},{"$f":"VLOOKUP(A24,商品信息!A:E,3,0)","v":{"$error":"#N/A"}},null,null,{"$f":"VLOOKUP(A24,入库表!B:H,5,0)","v":{"$error":"#N/A"}},{"$f":"VLOOKUP(A24,入库表!B:H,7,0)","v":{"$error":"#N/A"}},{"$error":"#N/A"},{"$f":"VLOOKUP(A24,出库表!B:H,5,0)","v":{"$error":"#N/A"}},{"$f":"VLOOKUP(A24,出库表!B:H,7,0)","v":{"$error":"#N/A"}},{"$error":"#N/A"},{"$error":"#N/A"},{"$error":"#N/A"}]
[null,{"$f":"VLOOKUP(A25,商品信息!A:E,2,0)","v":{"$error":"#N/A"}},{"$f":"VLOOKUP(A25,商品信息!A:E,3,0)","v":{"$error":"#N/A"}},null,null,{"$f":"VLOOKUP(A25,入库表!B:H,5,0)","v":{"$error":"#N/A"}},{"$f":"VLOOKUP(A25,入库表!B:H,7,0)","v":{"$error":"#N/A"}},{"$error":"#N/A"},{"$f":"VLOOKUP(A25,出库表!B:H,5,0)","v":{"$error":"#N/A"}},{"$f":"VLOOKUP(A25,出库表!B:H,7,0)","v":{"$error":"#N/A"}},{"$error":"#N/A"},{"$error":"#N/A"},{"$error":"#N/A"}]
[null,{"$f":"VLOOKUP(A26,商品信息!A:E,2,0)","v":{"$error":"#N/A"}},{"$f":"VLOOKUP(A26,商品信息!A:E,3,0)","v":{"$error":"#N/A"}},null,null,{"$f":"VLOOKUP(A26,入库表!B:H,5,0)","v":{"$error":"#N/A"}},{"$f":"VLOOKUP(A26,入库表!B:H,7,0)","v":{"$error":"#N/A"}},{"$error":"#N/A"},{"$f":"VLOOKUP(A26,出库表!B:H,5,0)","v":{"$error":"#N/A"}},{"$f":"VLOOKUP(A26,出库表!B:H,7,0)","v":{"$error":"#N/A"}},{"$error":"#N/A"},{"$error":"#N/A"},{"$error":"#N/A"}]
[null,{"$f":"VLOOKUP(A27,商品信息!A:E,2,0)","v":{"$error":"#N/A"}},{"$f":"VLOOKUP(A27,商品信息!A:E,3,0)","v":{"$error":"#N/A"}},null,null,{"$f":"VLOOKUP(A27,入库表!B:H,5,0)","v":{"$error":"#N/A"}},{"$f":"VLOOKUP(A27,入库表!B:H,7,0)","v":{"$error":"#N/A"}},{"$error":"#N/A"},{"$f":"VLOOKUP(A27,出库表!B:H,5,0)","v":{"$error":"#N/A"}},{"$f":"VLOOKUP(A27,出库表!B:H,7,0)","v":{"$error":"#N/A"}},{"$error":"#N/A"},{"$error":"#N/A"},{"$error":"#N/A"}]
[null,{"$f":"VLOOKUP(A28,商品信息!A:E,2,0)","v":{"$error":"#N/A"}},{"$f":"VLOOKUP(A28,商品信息!A:E,3,0)","v":{"$error":"#N/A"}},null,null,{"$f":"VLOOKUP(A28,入库表!B:H,5,0)","v":{"$error":"#N/A"}},{"$f":"VLOOKUP(A28,入库表!B:H,7,0)","v":{"$error":"#N/A"}},{"$error":"#N/A"},{"$f":"VLOOKUP(A28,出库表!B:H,5,0)","v":{"$error":"#N/A"}},{"$f":"VLOOKUP(A28,出库表!B:H,7,0)","v":{"$error":"#N/A"}},{"$error":"#N/A"},{"$error":"#N/A"},{"$error":"#N/A"}]
[null,{"$f":"VLOOKUP(A29,商品信息!A:E,2,0)","v":{"$error":"#N/A"}},{"$f":"VLOOKUP(A29,商品信息!A:E,3,0)","v":{"$error":"#N/A"}},null,null,{"$f":"VLOOKUP(A29,入库表!B:H,5,0)","v":{"$error":"#N/A"}},{"$f":"VLOOKUP(A29,入库表!B:H,7,0)","v":{"$error":"#N/A"}},{"$error":"#N/A"},{"$f":"VLOOKUP(A29,出库表!B:H,5,0)","v":{"$error":"#N/A"}},{"$f":"VLOOKUP(A29,出库表!B:H,7,0)","v":{"$error":"#N/A"}},{"$error":"#N/A"},{"$error":"#N/A"},{"$error":"#N/A"}]
[null,{"$f":"VLOOKUP(A30,商品信息!A:E,2,0)","v":{"$error":"#N/A"}},{"$f":"VLOOKUP(A30,商品信息!A:E,3,0)","v":{"$error":"#N/A"}},null,null,{"$f":"VLOOKUP(A30,入库表!B:H,5,0)","v":{"$error":"#N/A"}},{"$f":"VLOOKUP(A30,入库表!B:H,7,0)","v":{"$error":"#N/A"}},{"$error":"#N/A"},{"$f":"VLOOKUP(A30,出库表!B:H,5,0)","v":{"$error":"#N/A"}},{"$f":"VLOOKUP(A30,出库表!B:H,7,0)","v":{"$error":"#N/A"}},{"$error":"#N/A"},{"$error":"#N/A"},{"$error":"#N/A"}]
[null,{"$f":"VLOOKUP(A31,商品信息!A:E,2,0)","v":{"$error":"#N/A"}},{"$f":"VLOOKUP(A31,商品信息!A:E,3,0)","v":{"$error":"#N/A"}},null,null,{"$f":"VLOOKUP(A31,入库表!B:H,5,0)","v":{"$error":"#N/A"}},{"$f":"VLOOKUP(A31,入库表!B:H,7,0)","v":{"$error":"#N/A"}},{"$error":"#N/A"},{"$f":"VLOOKUP(A31,出库表!B:H,5,0)","v":{"$error":"#N/A"}},{"$f":"VLOOKUP(A31,出库表!B:H,7,0)","v":{"$error":"#N/A"}},{"$error":"#N/A"},{"$error":"#N/A"},{"$error":"#N/A"}]
[null,{"$f":"VLOOKUP(A32,商品信息!A:E,2,0)","v":{"$error":"#N/A"}},{"$f":"VLOOKUP(A32,商品信息!A:E,3,0)","v":{"$error":"#N/A"}},null,null,{"$f":"VLOOKUP(A32,入库表!B:H,5,0)","v":{"$error":"#N/A"}},{"$f":"VLOOKUP(A32,入库表!B:H,7,0)","v":{"$error":"#N/A"}},{"$error":"#N/A"},{"$f":"VLOOKUP(A32,出库表!B:H,5,0)","v":{"$error":"#N/A"}},{"$f":"VLOOKUP(A32,出库表!B:H,7,0)","v":{"$error":"#N/A"}},{"$error":"#N/A"},{"$error":"#N/A"},{"$error":"#N/A"}]
[null,{"$f":"VLOOKUP(A33,商品信息!A:E,2,0)","v":{"$error":"#N/A"}},{"$f":"VLOOKUP(A33,商品信息!A:E,3,0)","v":{"$error":"#N/A"}},null,null,{"$f":"VLOOKUP(A33,入库表!B:H,5,0)","v":{"$error":"#N/A"}},{"$f":"VLOOKUP(A33,入库表!B:H,7,0)","v":{"$error":"#N/A"}},{"$error":"#N/A"},{"$f":"VLOOKUP(A33,出库表!B:H,5,0)","v":{"$error":"#N/A"}},{"$f":"VLOOKUP(A33,出库表!B:H,7,0)","v":{"$error":"#N/A"}},{"$error":"#N/A"},{"$error":"#N/A"},{"$error":"#N/A"}]
[null,{"$f":"VLOOKUP(A34,商品信息!A:E,2,0)","v":{"$error":"#N/A"}},{"$f":"VLOOKUP(A34,商品信息!A:E,3,0)","v":{"$error":"#N/A"}},null,null,{"$f":"VLOOKUP(A34,入库表!B:H,5,0)","v":{"$error":"#N/A"}},{"$f":"VLOOKUP(A34,入库表!B:H,7,0)","v":{"$error":"#N/A"}},{"$error":"#N/A"},{"$f":"VLOOKUP(A34,出库表!B:H,5,0)","v":{"$error":"#N/A"}},{"$f":"VLOOKUP(A34,出库表!B:H,7,0)","v":{"$error":"#N/A"}},{"$error":"#N/A"},{"$error":"#N/A"},{"$error":"#N/A"}]
[null,{"$f":"VLOOKUP(A35,商品信息!A:E,2,0)","v":{"$error":"#N/A"}},{"$f":"VLOOKUP(A35,商品信息!A:E,3,0)","v":{"$error":"#N/A"}},null,null,{"$f":"VLOOKUP(A35,入库表!B:H,5,0)","v":{"$error":"#N/A"}},{"$f":"VLOOKUP(A35,入库表!B:H,7,0)","v":{"$error":"#N/A"}},{"$error":"#N/A"},{"$f":"VLOOKUP(A35,出库表!B:H,5,0)","v":{"$error":"#N/A"}},{"$f":"VLOOKUP(A35,出库表!B:H,7,0)","v":{"$error":"#N/A"}},{"$error":"#N/A"},{"$error":"#N/A"},{"$error":"#N/A"}]
[null,{"$f":"VLOOKUP(A36,商品信息!A:E,2,0)","v":{"$error":"#N/A"}},{"$f":"VLOOKUP(A36,商品信息!A:E,3,0)","v":{"$error":"#N/A"}},null,null,{"$f":"VLOOKUP(A36,入库表!B:H,5,0)","v":{"$error":"#N/A"}},{"$f":"VLOOKUP(A36,入库表!B:H,7,0)","v":{"$error":"#N/A"}},{"$error":"#N/A"},{"$f":"VLOOKUP(A36,出库表!B:H,5,0)","v":{"$error":"#N/A"}},{"$f":"VLOOKUP(A36,出库表!B:H,7,0)","v":{"$error":"#N/A"}},{"$error":"#N/A"},{"$error":"#N/A"},{"$error":"#N/A"}]
[null,{"$f":"VLOOKUP(A37,商品信息!A:E,2,0)","v":{"$error":"#N/A"}},{"$f":"VLOOKUP(A37,商品信息!A:E,3,0)","v":{"$error":"#N/A"}},null,null,{"$f":"VLOOKUP(A37,入库表!B:H,5,0)","v":{"$error":"#N/A"}},{"$f":"VLOOKUP(A37,入库表!B:H,7,0)","v":{"$error":"#N/A"}},{"$error":"#N/A"},{"$f":"VLOOKUP(A37,出库表!B:H,5,0)","v":{"$error":"#N/A"}},{"$f":"VLOOKUP(A37,出库表!B:H,7,0)","v":{"$error":"#N/A"}},{"$error":"#N/A"},{"$error":"#N/A"},{"$error":"#N/A"}]
[null,{"$f":"VLOOKUP(A38,商品信息!A:E,2,0)","v":{"$error":"#N/A"}},{"$f":"VLOOKUP(A38,商品信息!A:E,3,0)","v":{"$error":"#N/A"}},null,null,{"$f":"VLOOKUP(A38,入库表!B:H,5,0)","v":{"$error":"#N/A"}},{"$f":"VLOOKUP(A38,入库表!B:H,7,0)","v":{"$error":"#N/A"}},{"$error":"#N/A"},{"$f":"VLOOKUP(A38,出库表!B:H,5,0)","v":{"$error":"#N/A"}},{"$f":"VLOOKUP(A38,出库表!B:H,7,0)","v":{"$error":"#N/A"}},{"$error":"#N/A"},{"$error":"#N/A"},{"$error":"#N/A"}]
[null,{"$f":"VLOOKUP(A39,商品信息!A:E,2,0)","v":{"$error":"#N/A"}},{"$f":"VLOOKUP(A39,商品信息!A:E,3,0)","v":{"$error":"#N/A"}},null,null,{"$f":"VLOOKUP(A39,入库表!B:H,5,0)","v":{"$error":"#N/A"}},{"$f":"VLOOKUP(A39,入库表!B:H,7,0)","v":{"$error":"#N/A"}},{"$error":"#N/A"},{"$f":"VLOOKUP(A39,出库表!B:H,5,0)","v":{"$error":"#N/A"}},{"$f":"VLOOKUP(A39,出库表!B:H,7,0)","v":{"$error":"#N/A"}},{"$error":"#N/A"},{"$error":"#N/A"},{"$error":"#N/A"}]
[null,{"$f":"VLOOKUP(A40,商品信息!A:E,2,0)","v":{"$error":"#N/A"}},{"$f":"VLOOKUP(A40,商品信息!A:E,3,0)","v":{"$error":"#N/A"}},null,null,{"$f":"VLOOKUP(A40,入库表!B:H,5,0)","v":{"$error":"#N/A"}},{"$f":"VLOOKUP(A40,入库表!B:H,7,0)","v":{"$error":"#N/A"}},{"$error":"#N/A"},{"$f":"VLOOKUP(A40,出库表!B:H,5,0)","v":{"$error":"#N/A"}},{"$f":"VLOOKUP(A40,出库表!B:H,7,0)","v":{"$error":"#N/A"}},{"$error":"#N/A"},{"$error":"#N/A"},{"$error":"#N/A"}]
[null,{"$f":"VLOOKUP(A41,商品信息!A:E,2,0)","v":{"$error":"#N/A"}},{"$f":"VLOOKUP(A41,商品信息!A:E,3,0)","v":{"$error":"#N/A"}},null,null,{"$f":"VLOOKUP(A41,入库表!B:H,5,0)","v":{"$error":"#N/A"}},{"$f":"VLOOKUP(A41,入库表!B:H,7,0)","v":{"$error":"#N/A"}},{"$error":"#N/A"},{"$f":"VLOOKUP(A41,出库表!B:H,5,0)","v":{"$error":"#N/A"}},{"$f":"VLOOKUP(A41,出库表!B:H,7,0)","v":{"$error":"#N/A"}},{"$error":"#N/A"},{"$error":"#N/A"},{"$error":"#N/A"}]
[null,{"$f":"VLOOKUP(A42,商品信息!A:E,2,0)","v":{"$error":"#N/A"}},{"$f":"VLOOKUP(A42,商品信息!A:E,3,0)","v":{"$error":"#N/A"}},null,null,{"$f":"VLOOKUP(A42,入库表!B:H,5,0)","v":{"$error":"#N/A"}},{"$f":"VLOOKUP(A42,入库表!B:H,7,0)","v":{"$error":"#N/A"}},{"$error":"#N/A"},{"$f":"VLOOKUP(A42,出库表!B:H,5,0)","v":{"$error":"#N/A"}},{"$f":"VLOOKUP(A42,出库表!B:H,7,0)","v":{"$error":"#N/A"}},{"$error":"#N/A"},{"$error":"#N/A"},{"$error":"#N/A"}]
[null,{"$f":"VLOOKUP(A43,商品信息!A:E,2,0)","v":{"$error":"#N/A"}},{"$f":"VLOOKUP(A43,商品信息!A:E,3,0)","v":{"$error":"#N/A"}},null,null,{"$f":"VLOOKUP(A43,入库表!B:H,5,0)","v":{"$error":"#N/A"}},{"$f":"VLOOKUP(A43,入库表!B:H,7,0)","v":{"$error":"#N/A"}},{"$error":"#N/A"},{"$f":"VLOOKUP(A43,出库表!B:H,5,0)","v":{"$error":"#N/A"}},{"$f":"VLOOKUP(A43,出库表!B:H,7,0)","v":{"$error":"#N/A"}},{"$error":"#N/A"},{"$error":"#N/A"},{"$error":"#N/A"}]
[null,{"$f":"VLOOKUP(A44,商品信息!A:E,2,0)","v":{"$error":"#N/A"}},{"$f":"VLOOKUP(A44,商品信息!A:E,3,0)","v":{"$error":"#N/A"}},null,null,{"$f":"VLOOKUP(A44,入库表!B:H,5,0)","v":{"$error":"#N/A"}},{"$f":"VLOOKUP(A44,入库表!B:H,7,0)","v":{"$error":"#N/A"}},{"$error":"#N/A"},{"$f":"VLOOKUP(A44,出库表!B:H,5,0)","v":{"$error":"#N/A"}},{"$f":"VLOOKUP(A44,出库表!B:H,7,0)","v":{"$error":"#N/A"}},{"$error":"#N/A"},{"$error":"#N/A"},{"$error":"#N/A"}]
[null,{"$f":"VLOOKUP(A45,商品信息!A:E,2,0)","v":{"$error":"#N/A"}},{"$f":"VLOOKUP(A45,商品信息!A:E,3,0)","v":{"$error":"#N/A"}},null,null,{"$f":"VLOOKUP(A45,入库表!B:H,5,0)","v":{"$error":"#N/A"}},{"$f":"VLOOKUP(A45,入库表!B:H,7,0)","v":{"$error":"#N/A"}},{"$error":"#N/A"},{"$f":"VLOOKUP(A45,出库表!B:H,5,0)","v":{"$error":"#N/A"}},{"$f":"VLOOKUP(A45,出库表!B:H,7,0)","v":{"$error":"#N/A"}},{"$error":"#N/A"},{"$error":"#N/A"},{"$error":"#N/A"}]
[null,{"$f":"VLOOKUP(A46,商品信息!A:E,2,0)","v":{"$error":"#N/A"}},{"$f":"VLOOKUP(A46,商品信息!A:E,3,0)","v":{"$error":"#N/A"}},null,null,{"$f":"VLOOKUP(A46,入库表!B:H,5,0)","v":{"$error":"#N/A"}},{"$f":"VLOOKUP(A46,入库表!B:H,7,0)","v":{"$error":"#N/A"}},{"$error":"#N/A"},{"$f":"VLOOKUP(A46,出库表!B:H,5,0)","v":{"$error":"#N/A"}},{"$f":"VLOOKUP(A46,出库表!B:H,7,0)","v":{"$error":"#N/A"}},{"$error":"#N/A"},{"$error":"#N/A"},{"$error":"#N/A"}]
[null,{"$f":"VLOOKUP(A47,商品信息!A:E,2,0)","v":{"$error":"#N/A"}},{"$f":"VLOOKUP(A47,商品信息!A:E,3,0)","v":{"$error":"#N/A"}},null,null,{"$f":"VLOOKUP(A47,入库表!B:H,5,0)","v":{"$error":"#N/A"}},{"$f":"VLOOKUP(A47,入库表!B:H,7,0)","v":{"$error":"#N/A"}},{"$error":"#N/A"},{"$f":"VLOOKUP(A47,出库表!B:H,5,0)","v":{"$error":"#N/A"}},{"$f":"VLOOKUP(A47,出库表!B:H,7,0)","v":{"$error":"#N/A"}},{"$error":"#N/A"},{"$error":"#N/A"},{"$error":"#N/A"}]
[null,{"$f":"VLOOKUP(A48,商品信息!A:E,2,0)","v":{"$error":"#N/A"}},{"$f":"VLOOKUP(A48,商品信息!A:E,3,0)","v":{"$error":"#N/A"}},null,null,{"$f":"VLOOKUP(A48,入库表!B:H,5,0)","v":{"$error":"#N/A"}},{"$f":"VLOOKUP(A48,入库表!B:H,7,0)","v":{"$error":"#N/A"}},{"$error":"#N/A"},{"$f":"VLOOKUP(A48,出库表!B:H,5,0)","v":{"$error":"#N/A"}},{"$f":"VLOOKUP(A48,出库表!B:H,7,0)","v":{"$error":"#N/A"}},{"$error":"#N/A"},{"$error":"#N/A"},{"$error":"#N/A"}]
[null,{"$f":"VLOOKUP(A49,商品信息!A:E,2,0)","v":{"$error":"#N/A"}},{"$f":"VLOOKUP(A49,商品信息!A:E,3,0)","v":{"$error":"#N/A"}},null,null,{"$f":"VLOOKUP(A49,入库表!B:H,5,0)","v":{"$error":"#N/A"}},{"$f":"VLOOKUP(A49,入库表!B:H,7,0)","v":{"$error":"#N/A"}},{"$error":"#N/A"},{"$f":"VLOOKUP(A49,出库表!B:H,5,0)","v":{"$error":"#N/A"}},{"$f":"VLOOKUP(A49,出库表!B:H,7,0)","v":{"$error":"#N/A"}},{"$error":"#N/A"},{"$error":"#N/A"},{"$error":"#N/A"}]
[null,{"$f":"VLOOKUP(A50,商品信息!A:E,2,0)","v":{"$error":"#N/A"}},{"$f":"VLOOKUP(A50,商品信息!A:E,3,0)","v":{"$error":"#N/A"}},null,null,{"$f":"VLOOKUP(A50,入库表!B:H,5,0)","v":{"$error":"#N/A"}},{"$f":"VLOOKUP(A50,入库表!B:H,7,0)","v":{"$error":"#N/A"}},{"$error":"#N/A"},{"$f":"VLOOKUP(A50,出库表!B:H,5,0)","v":{"$error":"#N/A"}},{"$f":"VLOOKUP(A50,出库表!B:H,7,0)","v":{"$error":"#N/A"}},{"$error":"#N/A"},{"$error":"#N/A"},{"$error":"#N/A"}]
[null,{"$f":"VLOOKUP(A51,商品信息!A:E,2,0)","v":{"$error":"#N/A"}},{"$f":"VLOOKUP(A51,商品信息!A:E,3,0)","v":{"$error":"#N/A"}},null,null,{"$f":"VLOOKUP(A51,入库表!B:H,5,0)","v":{"$error":"#N/A"}},{"$f":"VLOOKUP(A51,入库表!B:H,7,0)","v":{"$error":"#N/A"}},{"$error":"#N/A"},{"$f":"VLOOKUP(A51,出库表!B:H,5,0)","v":{"$error":"#N/A"}},{"$f":"VLOOKUP(A51,出库表!B:H,7,0)","v":{"$error":"#N/A"}},{"$error":"#N/A"},{"$error":"#N/A"},{"$error":"#N/A"}]
[null,{"$f":"VLOOKUP(A52,商品信息!A:E,2,0)","v":{"$error":"#N/A"}},{"$f":"VLOOKUP(A52,商品信息!A:E,3,0)","v":{"$error":"#N/A"}},null,null,{"$f":"VLOOKUP(A52,入库表!B:H,5,0)","v":{"$error":"#N/A"}},{"$f":"VLOOKUP(A52,入库表!B:H,7,0)","v":{"$error":"#N/A"}},{"$error":"#N/A"},{"$f":"VLOOKUP(A52,出库表!B:H,5,0)","v":{"$error":"#N/A"}},{"$f":"VLOOKUP(A52,出库表!B:H,7,0)","v":{"$error":"#N/A"}},{"$error":"#N/A"},{"$error":"#N/A"},{"$error":"#N/A"}]
[null,{"$f":"VLOOKUP(A53,商品信息!A:E,2,0)","v":{"$error":"#N/A"}},{"$f":"VLOOKUP(A53,商品信息!A:E,3,0)","v":{"$error":"#N/A"}},null,null,{"$f":"VLOOKUP(A53,入库表!B:H,5,0)","v":{"$error":"#N/A"}},{"$f":"VLOOKUP(A53,入库表!B:H,7,0)","v":{"$error":"#N/A"}},{"$error":"#N/A"},{"$f":"VLOOKUP(A53,出库表!B:H,5,0)","v":{"$error":"#N/A"}},{"$f":"VLOOKUP(A53,出库表!B:H,7,0)","v":{"$error":"#N/A"}},{"$error":"#N/A"},{"$error":"#N/A"},{"$error":"#N/A"}]
[null,{"$f":"VLOOKUP(A54,商品信息!A:E,2,0)","v":{"$error":"#N/A"}},{"$f":"VLOOKUP(A54,商品信息!A:E,3,0)","v":{"$error":"#N/A"}},null,null,{"$f":"VLOOKUP(A54,入库表!B:H,5,0)","v":{"$error":"#N/A"}},{"$f":"VLOOKUP(A54,入库表!B:H,7,0)","v":{"$error":"#N/A"}},{"$error":"#N/A"},{"$f":"VLOOKUP(A54,出库表!B:H,5,0)","v":{"$error":"#N/A"}},{"$f":"VLOOKUP(A54,出库表!B:H,7,0)","v":{"$error":"#N/A"}},{"$error":"#N/A"},{"$error":"#N/A"},{"$error":"#N/A"}]
[null,{"$f":"VLOOKUP(A55,商品信息!A:E,2,0)","v":{"$error":"#N/A"}},{"$f":"VLOOKUP(A55,商品信息!A:E,3,0)","v":{"$error":"#N/A"}},null,null,{"$f":"VLOOKUP(A55,入库表!B:H,5,0)","v":{"$error":"#N/A"}},{"$f":"VLOOKUP(A55,入库表!B:H,7,0)","v":{"$error":"#N/A"}},{"$error":"#N/A"},{"$f":"VLOOKUP(A55,出库表!B:H,5,0)","v":{"$error":"#N/A"}},{"$f":"VLOOKUP(A55,出库表!B:H,7,0)","v":{"$error":"#N/A"}},{"$error":"#N/A"},{"$error":"#N/A"},{"$error":"#N/A"}]
[null,{"$f":"VLOOKUP(A56,商品信息!A:E,2,0)","v":{"$error":"#N/A"}},{"$f":"VLOOKUP(A56,商品信息!A:E,3,0)","v":{"$error":"#N/A"}},null,null,{"$f":"VLOOKUP(A56,入库表!B:H,5,0)","v":{"$error":"#N/A"}},{"$f":"VLOOKUP(A56,入库表!B:H,7,0)","v":{"$error":"#N/A"}},{"$error":"#N/A"},{"$f":"VLOOKUP(A56,出库表!B:H,5,0)","v":{"$error":"#N/A"}},{"$f":"VLOOKUP(A56,出库表!B:H,7,0)","v":{"$error":"#N/A"}},{"$error":"#N/A"},{"$error":"#N/A"},{"$error":"#N/A"}]
[null,{"$f":"VLOOKUP(A57,商品信息!A:E,2,0)","v":{"$error":"#N/A"}},{"$f":"VLOOKUP(A57,商品信息!A:E,3,0)","v":{"$error":"#N/A"}},null,null,{"$f":"VLOOKUP(A57,入库表!B:H,5,0)","v":{"$error":"#N/A"}},{"$f":"VLOOKUP(A57,入库表!B:H,7,0)","v":{"$error":"#N/A"}},{"$error":"#N/A"},{"$f":"VLOOKUP(A57,出库表!B:H,5,0)","v":{"$error":"#N/A"}},{"$f":"VLOOKUP(A57,出库表!B:H,7,0)","v":{"$error":"#N/A"}},{"$error":"#N/A"},{"$error":"#N/A"},{"$error":"#N/A"}]
[null,{"$f":"VLOOKUP(A58,商品信息!A:E,2,0)","v":{"$error":"#N/A"}},{"$f":"VLOOKUP(A58,商品信息!A:E,3,0)","v":{"$error":"#N/A"}},null,null,{"$f":"VLOOKUP(A58,入库表!B:H,5,0)","v":{"$error":"#N/A"}},{"$f":"VLOOKUP(A58,入库表!B:H,7,0)","v":{"$error":"#N/A"}},{"$error":"#N/A"},{"$f":"VLOOKUP(A58,出库表!B:H,5,0)","v":{"$error":"#N/A"}},{"$f":"VLOOKUP(A58,出库表!B:H,7,0)","v":{"$error":"#N/A"}},{"$error":"#N/A"},{"$error":"#N/A"},{"$error":"#N/A"}]
[null,{"$f":"VLOOKUP(A59,商品信息!A:E,2,0)","v":{"$error":"#N/A"}},{"$f":"VLOOKUP(A59,商品信息!A:E,3,0)","v":{"$error":"#N/A"}},null,null,{"$f":"VLOOKUP(A59,入库表!B:H,5,0)","v":{"$error":"#N/A"}},{"$f":"VLOOKUP(A59,入库表!B:H,7,0)","v":{"$error":"#N/A"}},{"$error":"#N/A"},{"$f":"VLOOKUP(A59,出库表!B:H,5,0)","v":{"$error":"#N/A"}},{"$f":"VLOOKUP(A59,出库表!B:H,7,0)","v":{"$error":"#N/A"}},{"$error":"#N/A"},{"$error":"#N/A"},{"$error":"#N/A"}]
[null,{"$f":"VLOOKUP(A60,商品信息!A:E,2,0)","v":{"$error":"#N/A"}},{"$f":"VLOOKUP(A60,商品信息!A:E,3,0)","v":{"$error":"#N/A"}},null,null,{"$f":"VLOOKUP(A60,入库表!B:H,5,0)","v":{"$error":"#N/A"}},{"$f":"VLOOKUP(A60,入库表!B:H,7,0)","v":{"$error":"#N/A"}},{"$error":"#N/A"},{"$f":"VLOOKUP(A60,出库表!B:H,5,0)","v":{"$error":"#N/A"}},{"$f":"VLOOKUP(A60,出库表!B:H,7,0)","v":{"$error":"#N/A"}},{"$error":"#N/A"},{"$error":"#N/A"},{"$error":"#N/A"}]
[null,{"$f":"VLOOKUP(A61,商品信息!A:E,2,0)","v":{"$error":"#N/A"}},{"$f":"VLOOKUP(A61,商品信息!A:E,3,0)","v":{"$error":"#N/A"}},null,null,{"$f":"VLOOKUP(A61,入库表!B:H,5,0)","v":{"$error":"#N/A"}},{"$f":"VLOOKUP(A61,入库表!B:H,7,0)","v":{"$error":"#N/A"}},{"$error":"#N/A"},{"$f":"VLOOKUP(A61,出库表!B:H,5,0)","v":{"$error":"#N/A"}},{"$f":"VLOOKUP(A61,出库表!B:H,7,0)","v":{"$error":"#N/A"}},{"$error":"#N/A"},{"$error":"#N/A"},{"$error":"#N/A"}]
[null,{"$f":"VLOOKUP(A62,商品信息!A:E,2,0)","v":{"$error":"#N/A"}},{"$f":"VLOOKUP(A62,商品信息!A:E,3,0)","v":{"$error":"#N/A"}},null,null,{"$f":"VLOOKUP(A62,入库表!B:H,5,0)","v":{"$error":"#N/A"}},{"$f":"VLOOKUP(A62,入库表!B:H,7,0)","v":{"$error":"#N/A"}},{"$error":"#N/A"},{"$f":"VLOOKUP(A62,出库表!B:H,5,0)","v":{"$error":"#N/A"}},{"$f":"VLOOKUP(A62,出库表!B:H,7,0)","v":{"$error":"#N/A"}},{"$error":"#N/A"},{"$error":"#N/A"},{"$error":"#N/A"}]
[null,{"$f":"VLOOKUP(A63,商品信息!A:E,2,0)","v":{"$error":"#N/A"}},{"$f":"VLOOKUP(A63,商品信息!A:E,3,0)","v":{"$error":"#N/A"}},null,null,{"$f":"VLOOKUP(A63,入库表!B:H,5,0)","v":{"$error":"#N/A"}},{"$f":"VLOOKUP(A63,入库表!B:H,7,0)","v":{"$error":"#N/A"}},{"$error":"#N/A"},{"$f":"VLOOKUP(A63,出库表!B:H,5,0)","v":{"$error":"#N/A"}},{"$f":"VLOOKUP(A63,出库表!B:H,7,0)","v":{"$error":"#N/A"}},{"$error":"#N/A"},{"$error":"#N/A"},{"$error":"#N/A"}]
[null,{"$f":"VLOOKUP(A64,商品信息!A:E,2,0)","v":{"$error":"#N/A"}},{"$f":"VLOOKUP(A64,商品信息!A:E,3,0)","v":{"$error":"#N/A"}},null,null,{"$f":"VLOOKUP(A64,入库表!B:H,5,0)","v":{"$error":"#N/A"}},{"$f":"VLOOKUP(A64,入库表!B:H,7,0)","v":{"$error":"#N/A"}},{"$error":"#N/A"},{"$f":"VLOOKUP(A64,出库表!B:H,5,0)","v":{"$error":"#N/A"}},{"$f":"VLOOKUP(A64,出库表!B:H,7,0)","v":{"$error":"#N/A"}},{"$error":"#N/A"},{"$error":"#N/A"},{"$error":"#N/A"}]
[null,{"$f":"VLOOKUP(A65,商品信息!A:E,2,0)","v":{"$error":"#N/A"}},{"$f":"VLOOKUP(A65,商品信息!A:E,3,0)","v":{"$error":"#N/A"}},null,null,{"$f":"VLOOKUP(A65,入库表!B:H,5,0)","v":{"$error":"#N/A"}},{"$f":"VLOOKUP(A65,入库表!B:H,7,0)","v":{"$error":"#N/A"}},{"$error":"#N/A"},{"$f":"VLOOKUP(A65,出库表!B:H,5,0)","v":{"$error":"#N/A"}},{"$f":"VLOOKUP(A65,出库表!B:H,7,0)","v":{"$error":"#N/A"}},{"$error":"#N/A"},{"$error":"#N/A"},{"$error":"#N/A"}]
[null,{"$f":"VLOOKUP(A66,商品信息!A:E,2,0)","v":{"$error":"#N/A"}},{"$f":"VLOOKUP(A66,商品信息!A:E,3,0)","v":{"$error":"#N/A"}},null,null,{"$f":"VLOOKUP(A66,入库表!B:H,5,0)","v":{"$error":"#N/A"}},{"$f":"VLOOKUP(A66,入库表!B:H,7,0)","v":{"$error":"#N/A"}},{"$error":"#N/A"},{"$f":"VLOOKUP(A66,出库表!B:H,5,0)","v":{"$error":"#N/A"}},{"$f":"VLOOKUP(A66,出库表!B:H,7,0)","v":{"$error":"#N/A"}},{"$error":"#N/A"},{"$error":"#N/A"},{"$error":"#N/A"}]
[null,{"$f":"VLOOKUP(A67,商品信息!A:E,2,0)","v":{"$error":"#N/A"}},{"$f":"VLOOKUP(A67,商品信息!A:E,3,0)","v":{"$error":"#N/A"}},null,null,{"$f":"VLOOKUP(A67,入库表!B:H,5,0)","v":{"$error":"#N/A"}},{"$f":"VLOOKUP(A67,入库表!B:H,7,0)","v":{"$error":"#N/A"}},{"$f":"F67*G67","v":{"$error":"#N/A"}},{"$f":"VLOOKUP(A67,出库表!B:H,5,0)","v":{"$error":"#N/A"}},{"$f":"VLOOKUP(A67,出库表!B:H,7,0)","v":{"$error":"#N/A"}},{"$error":"#N/A"},{"$error":"#N/A"},{"$error":"#N/A"}]
[null,{"$f":"VLOOKUP(A68,商品信息!A:E,2,0)","v":{"$error":"#N/A"}},{"$f":"VLOOKUP(A68,商品信息!A:E,3,0)","v":{"$error":"#N/A"}},null,null,{"$f":"VLOOKUP(A68,入库表!B:H,5,0)","v":{"$error":"#N/A"}},{"$f":"VLOOKUP(A68,入库表!B:H,7,0)","v":{"$error":"#N/A"}},{"$error":"#N/A"},{"$f":"VLOOKUP(A68,出库表!B:H,5,0)","v":{"$error":"#N/A"}},{"$f":"VLOOKUP(A68,出库表!B:H,7,0)","v":{"$error":"#N/A"}},{"$f":"I68*J68","v":{"$error":"#N/A"}},{"$f":"F68-I68","v":{"$error":"#N/A"}},{"$f":"I68*(J68-G68)","v":{"$error":"#N/A"}}]
[null,{"$f":"VLOOKUP(A69,商品信息!A:E,2,0)","v":{"$error":"#N/A"}},{"$f":"VLOOKUP(A69,商品信息!A:E,3,0)","v":{"$error":"#N/A"}},null,null,{"$f":"VLOOKUP(A69,入库表!B:H,5,0)","v":{"$error":"#N/A"}},{"$f":"VLOOKUP(A69,入库表!B:H,7,0)","v":{"$error":"#N/A"}},{"$error":"#N/A"},{"$f":"VLOOKUP(A69,出库表!B:H,5,0)","v":{"$error":"#N/A"}},{"$f":"VLOOKUP(A69,出库表!B:H,7,0)","v":{"$error":"#N/A"}},{"$error":"#N/A"},{"$error":"#N/A"},{"$error":"#N/A"}]
[null,{"$f":"VLOOKUP(A70,商品信息!A:E,2,0)","v":{"$error":"#N/A"}},{"$f":"VLOOKUP(A70,商品信息!A:E,3,0)","v":{"$error":"#N/A"}},null,null,{"$f":"VLOOKUP(A70,入库表!B:H,5,0)","v":{"$error":"#N/A"}},{"$f":"VLOOKUP(A70,入库表!B:H,7,0)","v":{"$error":"#N/A"}},{"$error":"#N/A"},{"$f":"VLOOKUP(A70,出库表!B:H,5,0)","v":{"$error":"#N/A"}},{"$f":"VLOOKUP(A70,出库表!B:H,7,0)","v":{"$error":"#N/A"}},{"$error":"#N/A"},{"$error":"#N/A"},{"$error":"#N/A"}]
[null,{"$f":"VLOOKUP(A71,商品信息!A:E,2,0)","v":{"$error":"#N/A"}},{"$f":"VLOOKUP(A71,商品信息!A:E,3,0)","v":{"$error":"#N/A"}},null,null,{"$f":"VLOOKUP(A71,入库表!B:H,5,0)","v":{"$error":"#N/A"}},{"$f":"VLOOKUP(A71,入库表!B:H,7,0)","v":{"$error":"#N/A"}},{"$error":"#N/A"},{"$f":"VLOOKUP(A71,出库表!B:H,5,0)","v":{"$error":"#N/A"}},{"$f":"VLOOKUP(A71,出库表!B:H,7,0)","v":{"$error":"#N/A"}},{"$error":"#N/A"},{"$error":"#N/A"},{"$error":"#N/A"}]
[null,{"$f":"VLOOKUP(A72,商品信息!A:E,2,0)","v":{"$error":"#N/A"}},{"$f":"VLOOKUP(A72,商品信息!A:E,3,0)","v":{"$error":"#N/A"}},null,null,{"$f":"VLOOKUP(A72,入库表!B:H,5,0)","v":{"$error":"#N/A"}},{"$f":"VLOOKUP(A72,入库表!B:H,7,0)","v":{"$error":"#N/A"}},{"$error":"#N/A"},{"$f":"VLOOKUP(A72,出库表!B:H,5,0)","v":{"$error":"#N/A"}},{"$f":"VLOOKUP(A72,出库表!B:H,7,0)","v":{"$error":"#N/A"}},{"$error":"#N/A"},{"$error":"#N/A"},{"$error":"#N/A"}]
[null,{"$f":"VLOOKUP(A73,商品信息!A:E,2,0)","v":{"$error":"#N/A"}},{"$f":"VLOOKUP(A73,商品信息!A:E,3,0)","v":{"$error":"#N/A"}},null,null,{"$f":"VLOOKUP(A73,入库表!B:H,5,0)","v":{"$error":"#N/A"}},{"$f":"VLOOKUP(A73,入库表!B:H,7,0)","v":{"$error":"#N/A"}},{"$error":"#N/A"},{"$f":"VLOOKUP(A73,出库表!B:H,5,0)","v":{"$error":"#N/A"}},{"$f":"VLOOKUP(A73,出库表!B:H,7,0)","v":{"$error":"#N/A"}},{"$error":"#N/A"},{"$error":"#N/A"},{"$error":"#N/A"}]
[null,{"$f":"VLOOKUP(A74,商品信息!A:E,2,0)","v":{"$error":"#N/A"}},{"$f":"VLOOKUP(A74,商品信息!A:E,3,0)","v":{"$error":"#N/A"}},null,null,{"$f":"VLOOKUP(A74,入库表!B:H,5,0)","v":{"$error":"#N/A"}},{"$f":"VLOOKUP(A74,入库表!B:H,7,0)","v":{"$error":"#N/A"}},{"$error":"#N/A"},{"$f":"VLOOKUP(A74,出库表!B:H,5,0)","v":{"$error":"#N/A"}},{"$f":"VLOOKUP(A74,出库表!B:H,7,0)","v":{"$error":"#N/A"}},{"$error":"#N/A"},{"$error":"#N/A"},{"$error":"#N/A"}]
[null,{"$f":"VLOOKUP(A75,商品信息!A:E,2,0)","v":{"$error":"#N/A"}},{"$f":"VLOOKUP(A75,商品信息!A:E,3,0)","v":{"$error":"#N/A"}},null,null,{"$f":"VLOOKUP(A75,入库表!B:H,5,0)","v":{"$error":"#N/A"}},{"$f":"VLOOKUP(A75,入库表!B:H,7,0)","v":{"$error":"#N/A"}},{"$error":"#N/A"},{"$f":"VLOOKUP(A75,出库表!B:H,5,0)","v":{"$error":"#N/A"}},{"$f":"VLOOKUP(A75,出库表!B:H,7,0)","v":{"$error":"#N/A"}},{"$error":"#N/A"},{"$error":"#N/A"},{"$error":"#N/A"}]
[null,{"$f":"VLOOKUP(A76,商品信息!A:E,2,0)","v":{"$error":"#N/A"}},{"$f":"VLOOKUP(A76,商品信息!A:E,3,0)","v":{"$error":"#N/A"}},null,null,{"$f":"VLOOKUP(A76,入库表!B:H,5,0)","v":{"$error":"#N/A"}},{"$f":"VLOOKUP(A76,入库表!B:H,7,0)","v":{"$error":"#N/A"}},{"$error":"#N/A"},{"$f":"VLOOKUP(A76,出库表!B:H,5,0)","v":{"$error":"#N/A"}},{"$f":"VLOOKUP(A76,出库表!B:H,7,0)","v":{"$error":"#N/A"}},{"$error":"#N/A"},{"$error":"#N/A"},{"$error":"#N/A"}]
[null,{"$f":"VLOOKUP(A77,商品信息!A:E,2,0)","v":{"$error":"#N/A"}},{"$f":"VLOOKUP(A77,商品信息!A:E,3,0)","v":{"$error":"#N/A"}},null,null,{"$f":"VLOOKUP(A77,入库表!B:H,5,0)","v":{"$error":"#N/A"}},{"$f":"VLOOKUP(A77,入库表!B:H,7,0)","v":{"$error":"#N/A"}},{"$error":"#N/A"},{"$f":"VLOOKUP(A77,出库表!B:H,5,0)","v":{"$error":"#N/A"}},{"$f":"VLOOKUP(A77,出库表!B:H,7,0)","v":{"$error":"#N/A"}},{"$error":"#N/A"},{"$error":"#N/A"},{"$error":"#N/A"}]
[null,{"$f":"VLOOKUP(A78,商品信息!A:E,2,0)","v":{"$error":"#N/A"}},{"$f":"VLOOKUP(A78,商品信息!A:E,3,0)","v":{"$error":"#N/A"}},null,null,{"$f":"VLOOKUP(A78,入库表!B:H,5,0)","v":{"$error":"#N/A"}},{"$f":"VLOOKUP(A78,入库表!B:H,7,0)","v":{"$error":"#N/A"}},{"$error":"#N/A"},{"$f":"VLOOKUP(A78,出库表!B:H,5,0)","v":{"$error":"#N/A"}},{"$f":"VLOOKUP(A78,出库表!B:H,7,0)","v":{"$error":"#N/A"}},{"$error":"#N/A"},{"$error":"#N/A"},{"$error":"#N/A"}]
[null,{"$f":"VLOOKUP(A79,商品信息!A:E,2,0)","v":{"$error":"#N/A"}},{"$f":"VLOOKUP(A79,商品信息!A:E,3,0)","v":{"$error":"#N/A"}},null,null,{"$f":"VLOOKUP(A79,入库表!B:H,5,0)","v":{"$error":"#N/A"}},{"$f":"VLOOKUP(A79,入库表!B:H,7,0)","v":{"$error":"#N/A"}},{"$error":"#N/A"},{"$f":"VLOOKUP(A79,出库表!B:H,5,0)","v":{"$error":"#N/A"}},{"$f":"VLOOKUP(A79,出库表!B:H,7,0)","v":{"$error":"#N/A"}},{"$error":"#N/A"},{"$error":"#N/A"},{"$error":"#N/A"}]
[null,{"$f":"VLOOKUP(A80,商品信息!A:E,2,0)","v":{"$error":"#N/A"}},{"$f":"VLOOKUP(A80,商品信息!A:E,3,0)","v":{"$error":"#N/A"}},null,null,{"$f":"VLOOKUP(A80,入库表!B:H,5,0)","v":{"$error":"#N/A"}},{"$f":"VLOOKUP(A80,入库表!B:H,7,0)","v":{"$error":"#N/A"}},{"$error":"#N/A"},{"$f":"VLOOKUP(A80,出库表!B:H,5,0)","v":{"$error":"#N/A"}},{"$f":"VLOOKUP(A80,出库表!B:H,7,0)","v":{"$error":"#N/A"}},{"$error":"#N/A"},{"$error":"#N/A"},{"$error":"#N/A"}]
[null,{"$f":"VLOOKUP(A81,商品信息!A:E,2,0)","v":{"$error":"#N/A"}},{"$f":"VLOOKUP(A81,商品信息!A:E,3,0)","v":{"$error":"#N/A"}},null,null,{"$f":"VLOOKUP(A81,入库表!B:H,5,0)","v":{"$error":"#N/A"}},{"$f":"VLOOKUP(A81,入库表!B:H,7,0)","v":{"$error":"#N/A"}},{"$error":"#N/A"},{"$f":"VLOOKUP(A81,出库表!B:H,5,0)","v":{"$error":"#N/A"}},{"$f":"VLOOKUP(A81,出库表!B:H,7,0)","v":{"$error":"#N/A"}},{"$error":"#N/A"},{"$error":"#N/A"},{"$error":"#N/A"}]
[null,{"$f":"VLOOKUP(A82,商品信息!A:E,2,0)","v":{"$error":"#N/A"}},{"$f":"VLOOKUP(A82,商品信息!A:E,3,0)","v":{"$error":"#N/A"}},null,null,{"$f":"VLOOKUP(A82,入库表!B:H,5,0)","v":{"$error":"#N/A"}},{"$f":"VLOOKUP(A82,入库表!B:H,7,0)","v":{"$error":"#N/A"}},{"$error":"#N/A"},{"$f":"VLOOKUP(A82,出库表!B:H,5,0)","v":{"$error":"#N/A"}},{"$f":"VLOOKUP(A82,出库表!B:H,7,0)","v":{"$error":"#N/A"}},{"$error":"#N/A"},{"$error":"#N/A"},{"$error":"#N/A"}]
[null,{"$f":"VLOOKUP(A83,商品信息!A:E,2,0)","v":{"$error":"#N/A"}},{"$f":"VLOOKUP(A83,商品信息!A:E,3,0)","v":{"$error":"#N/A"}},null,null,{"$f":"VLOOKUP(A83,入库表!B:H,5,0)","v":{"$error":"#N/A"}},{"$f":"VLOOKUP(A83,入库表!B:H,7,0)","v":{"$error":"#N/A"}},{"$error":"#N/A"},{"$f":"VLOOKUP(A83,出库表!B:H,5,0)","v":{"$error":"#N/A"}},{"$f":"VLOOKUP(A83,出库表!B:H,7,0)","v":{"$error":"#N/A"}},{"$error":"#N/A"},{"$error":"#N/A"},{"$error":"#N/A"}]
[null,{"$f":"VLOOKUP(A84,商品信息!A:E,2,0)","v":{"$error":"#N/A"}},{"$f":"VLOOKUP(A84,商品信息!A:E,3,0)","v":{"$error":"#N/A"}},null,null,{"$f":"VLOOKUP(A84,入库表!B:H,5,0)","v":{"$error":"#N/A"}},{"$f":"VLOOKUP(A84,入库表!B:H,7,0)","v":{"$error":"#N/A"}},{"$error":"#N/A"},{"$f":"VLOOKUP(A84,出库表!B:H,5,0)","v":{"$error":"#N/A"}},{"$f":"VLOOKUP(A84,出库表!B:H,7,0)","v":{"$error":"#N/A"}},{"$error":"#N/A"},{"$error":"#N/A"},{"$error":"#N/A"}]
[null,{"$f":"VLOOKUP(A85,商品信息!A:E,2,0)","v":{"$error":"#N/A"}},{"$f":"VLOOKUP(A85,商品信息!A:E,3,0)","v":{"$error":"#N/A"}},null,null,{"$f":"VLOOKUP(A85,入库表!B:H,5,0)","v":{"$error":"#N/A"}},{"$f":"VLOOKUP(A85,入库表!B:H,7,0)","v":{"$error":"#N/A"}},{"$error":"#N/A"},{"$f":"VLOOKUP(A85,出库表!B:H,5,0)","v":{"$error":"#N/A"}},{"$f":"VLOOKUP(A85,出库表!B:H,7,0)","v":{"$error":"#N/A"}},{"$error":"#N/A"},{"$error":"#N/A"},{"$error":"#N/A"}]
[null,{"$f":"VLOOKUP(A86,商品信息!A:E,2,0)","v":{"$error":"#N/A"}},{"$f":"VLOOKUP(A86,商品信息!A:E,3,0)","v":{"$error":"#N/A"}},null,null,{"$f":"VLOOKUP(A86,入库表!B:H,5,0)","v":{"$error":"#N/A"}},{"$f":"VLOOKUP(A86,入库表!B:H,7,0)","v":{"$error":"#N/A"}},{"$error":"#N/A"},{"$f":"VLOOKUP(A86,出库表!B:H,5,0)","v":{"$error":"#N/A"}},{"$f":"VLOOKUP(A86,出库表!B:H,7,0)","v":{"$error":"#N/A"}},{"$error":"#N/A"},{"$error":"#N/A"},{"$error":"#N/A"}]
[null,{"$f":"VLOOKUP(A87,商品信息!A:E,2,0)","v":{"$error":"#N/A"}},{"$f":"VLOOKUP(A87,商品信息!A:E,3,0)","v":{"$error":"#N/A"}},null,null,{"$f":"VLOOKUP(A87,入库表!B:H,5,0)","v":{"$error":"#N/A"}},{"$f":"VLOOKUP(A87,入库表!B:H,7,0)","v":{"$error":"#N/A"}},{"$error":"#N/A"},{"$f":"VLOOKUP(A87,出库表!B:H,5,0)","v":{"$error":"#N/A"}},{"$f":"VLOOKUP(A87,出库表!B:H,7,0)","v":{"$error":"#N/A"}},{"$error":"#N/A"},{"$error":"#N/A"},{"$error":"#N/A"}]
[null,{"$f":"VLOOKUP(A88,商品信息!A:E,2,0)","v":{"$error":"#N/A"}},{"$f":"VLOOKUP(A88,商品信息!A:E,3,0)","v":{"$error":"#N/A"}},null,null,{"$f":"VLOOKUP(A88,入库表!B:H,5,0)","v":{"$error":"#N/A"}},{"$f":"VLOOKUP(A88,入库表!B:H,7,0)","v":{"$error":"#N/A"}},{"$error":"#N/A"},{"$f":"VLOOKUP(A88,出库表!B:H,5,0)","v":{"$error":"#N/A"}},{"$f":"VLOOKUP(A88,出库表!B:H,7,0)","v":{"$error":"#N/A"}},{"$error":"#N/A"},{"$error":"#N/A"},{"$error":"#N/A"}]
[null,{"$f":"VLOOKUP(A89,商品信息!A:E,2,0)","v":{"$error":"#N/A"}},{"$f":"VLOOKUP(A89,商品信息!A:E,3,0)","v":{"$error":"#N/A"}},null,null,{"$f":"VLOOKUP(A89,入库表!B:H,5,0)","v":{"$error":"#N/A"}},{"$f":"VLOOKUP(A89,入库表!B:H,7,0)","v":{"$error":"#N/A"}},{"$error":"#N/A"},{"$f":"VLOOKUP(A89,出库表!B:H,5,0)","v":{"$error":"#N/A"}},{"$f":"VLOOKUP(A89,出库表!B:H,7,0)","v":{"$error":"#N/A"}},{"$error":"#N/A"},{"$error":"#N/A"},{"$error":"#N/A"}]
[null,{"$f":"VLOOKUP(A90,商品信息!A:E,2,0)","v":{"$error":"#N/A"}},{"$f":"VLOOKUP(A90,商品信息!A:E,3,0)","v":{"$error":"#N/A"}},null,null,{"$f":"VLOOKUP(A90,入库表!B:H,5,0)","v":{"$error":"#N/A"}},{"$f":"VLOOKUP(A90,入库表!B:H,7,0)","v":{"$error":"#N/A"}},{"$error":"#N/A"},{"$f":"VLOOKUP(A90,出库表!B:H,5,0)","v":{"$error":"#N/A"}},{"$f":"VLOOKUP(A90,出库表!B:H,7,0)","v":{"$error":"#N/A"}},{"$error":"#N/A"},{"$error":"#N/A"},{"$error":"#N/A"}]
[null,{"$f":"VLOOKUP(A91,商品信息!A:E,2,0)","v":{"$error":"#N/A"}},{"$f":"VLOOKUP(A91,商品信息!A:E,3,0)","v":{"$error":"#N/A"}},null,null,{"$f":"VLOOKUP(A91,入库表!B:H,5,0)","v":{"$error":"#N/A"}},{"$f":"VLOOKUP(A91,入库表!B:H,7,0)","v":{"$error":"#N/A"}},{"$error":"#N/A"},{"$f":"VLOOKUP(A91,出库表!B:H,5,0)","v":{"$error":"#N/A"}},{"$f":"VLOOKUP(A91,出库表!B:H,7,0)","v":{"$error":"#N/A"}},{"$error":"#N/A"},{"$error":"#N/A"},{"$error":"#N/A"}]
[null,{"$f":"VLOOKUP(A92,商品信息!A:E,2,0)","v":{"$error":"#N/A"}},{"$f":"VLOOKUP(A92,商品信息!A:E,3,0)","v":{"$error":"#N/A"}},null,null,{"$f":"VLOOKUP(A92,入库表!B:H,5,0)","v":{"$error":"#N/A"}},{"$f":"VLOOKUP(A92,入库表!B:H,7,0)","v":{"$error":"#N/A"}},{"$error":"#N/A"},{"$f":"VLOOKUP(A92,出库表!B:H,5,0)","v":{"$error":"#N/A"}},{"$f":"VLOOKUP(A92,出库表!B:H,7,0)","v":{"$error":"#N/A"}},{"$error":"#N/A"},{"$error":"#N/A"},{"$error":"#N/A"}]
[null,{"$f":"VLOOKUP(A93,商品信息!A:E,2,0)","v":{"$error":"#N/A"}},{"$f":"VLOOKUP(A93,商品信息!A:E,3,0)","v":{"$error":"#N/A"}},null,null,{"$f":"VLOOKUP(A93,入库表!B:H,5,0)","v":{"$error":"#N/A"}},{"$f":"VLOOKUP(A93,入库表!B:H,7,0)","v":{"$error":"#N/A"}},{"$error":"#N/A"},{"$f":"VLOOKUP(A93,出库表!B:H,5,0)","v":{"$error":"#N/A"}},{"$f":"VLOOKUP(A93,出库表!B:H,7,0)","v":{"$error":"#N/A"}},{"$error":"#N/A"},{"$error":"#N/A"},{"$error":"#N/A"}]
[null,{"$f":"VLOOKUP(A94,商品信息!A:E,2,0)","v":{"$error":"#N/A"}},{"$f":"VLOOKUP(A94,商品信息!A:E,3,0)","v":{"$error":"#N/A"}},null,null,{"$f":"VLOOKUP(A94,入库表!B:H,5,0)","v":{"$error":"#N/A"}},{"$f":"VLOOKUP(A94,入库表!B:H,7,0)","v":{"$error":"#N/A"}},{"$error":"#N/A"},{"$f":"VLOOKUP(A94,出库表!B:H,5,0)","v":{"$error":"#N/A"}},{"$f":"VLOOKUP(A94,出库表!B:H,7,0)","v":{"$error":"#N/A"}},{"$error":"#N/A"},{"$error":"#N/A"},{"$error":"#N/A"}]
[null,{"$f":"VLOOKUP(A95,商品信息!A:E,2,0)","v":{"$error":"#N/A"}},{"$f":"VLOOKUP(A95,商品信息!A:E,3,0)","v":{"$error":"#N/A"}},null,null,{"$f":"VLOOKUP(A95,入库表!B:H,5,0)","v":{"$error":"#N/A"}},{"$f":"VLOOKUP(A95,入库表!B:H,7,0)","v":{"$error":"#N/A"}},{"$error":"#N/A"},{"$f":"VLOOKUP(A95,出库表!B:H,5,0)","v":{"$error":"#N/A"}},{"$f":"VLOOKUP(A95,出库表!B:H,7,0)","v":{"$error":"#N/A"}},{"$error":"#N/A"},{"$error":"#N/A"},{"$error":"#N/A"}]
[null,{"$f":"VLOOKUP(A96,商品信息!A:E,2,0)","v":{"$error":"#N/A"}},{"$f":"VLOOKUP(A96,商品信息!A:E,3,0)","v":{"$error":"#N/A"}},null,null,{"$f":"VLOOKUP(A96,入库表!B:H,5,0)","v":{"$error":"#N/A"}},{"$f":"VLOOKUP(A96,入库表!B:H,7,0)","v":{"$error":"#N/A"}},{"$error":"#N/A"},{"$f":"VLOOKUP(A96,出库表!B:H,5,0)","v":{"$error":"#N/A"}},{"$f":"VLOOKUP(A96,出库表!B:H,7,0)","v":{"$error":"#N/A"}},{"$error":"#N/A"},{"$error":"#N/A"},{"$error":"#N/A"}]
[null,{"$f":"VLOOKUP(A97,商品信息!A:E,2,0)","v":{"$error":"#N/A"}},{"$f":"VLOOKUP(A97,商品信息!A:E,3,0)","v":{"$error":"#N/A"}},null,null,{"$f":"VLOOKUP(A97,入库表!B:H,5,0)","v":{"$error":"#N/A"}},{"$f":"VLOOKUP(A97,入库表!B:H,7,0)","v":{"$error":"#N/A"}},{"$error":"#N/A"},{"$f":"VLOOKUP(A97,出库表!B:H,5,0)","v":{"$error":"#N/A"}},{"$f":"VLOOKUP(A97,出库表!B:H,7,0)","v":{"$error":"#N/A"}},{"$error":"#N/A"},{"$error":"#N/A"},{"$error":"#N/A"}]
[null,{"$f":"VLOOKUP(A98,商品信息!A:E,2,0)","v":{"$error":"#N/A"}},{"$f":"VLOOKUP(A98,商品信息!A:E,3,0)","v":{"$error":"#N/A"}},null,null,{"$f":"VLOOKUP(A98,入库表!B:H,5,0)","v":{"$error":"#N/A"}},{"$f":"VLOOKUP(A98,入库表!B:H,7,0)","v":{"$error":"#N/A"}},{"$error":"#N/A"},{"$f":"VLOOKUP(A98,出库表!B:H,5,0)","v":{"$error":"#N/A"}},{"$f":"VLOOKUP(A98,出库表!B:H,7,0)","v":{"$error":"#N/A"}},{"$error":"#N/A"},{"$error":"#N/A"},{"$error":"#N/A"}]
[null,{"$f":"VLOOKUP(A99,商品信息!A:E,2,0)","v":{"$error":"#N/A"}},{"$f":"VLOOKUP(A99,商品信息!A:E,3,0)","v":{"$error":"#N/A"}},null,null,{"$f":"VLOOKUP(A99,入库表!B:H,5,0)","v":{"$error":"#N/A"}},{"$f":"VLOOKUP(A99,入库表!B:H,7,0)","v":{"$error":"#N/A"}},{"$error":"#N/A"},{"$f":"VLOOKUP(A99,出库表!B:H,5,0)","v":{"$error":"#N/A"}},{"$f":"VLOOKUP(A99,出库表!B:H,7,0)","v":{"$error":"#N/A"}},{"$error":"#N/A"},{"$error":"#N/A"},{"$error":"#N/A"}]
[null,{"$f":"VLOOKUP(A100,商品信息!A:E,2,0)","v":{"$error":"#N/A"}},{"$f":"VLOOKUP(A100,商品信息!A:E,3,0)","v":{"$error":"#N/A"}},null,null,{"$f":"VLOOKUP(A100,入库表!B:H,5,0)","v":{"$error":"#N/A"}},{"$f":"VLOOKUP(A100,入库表!B:H,7,0)","v":{"$error":"#N/A"}},{"$error":"#N/A"},{"$f":"VLOOKUP(A100,出库表!B:H,5,0)","v":{"$error":"#N/A"}},{"$f":"VLOOKUP(A100,出库表!B:H,7,0)","v":{"$error":"#N/A"}},{"$error":"#N/A"},{"$error":"#N/A"},{"$error":"#N/A"}]
[null,{"$f":"VLOOKUP(A101,商品信息!A:E,2,0)","v":{"$error":"#N/A"}},{"$f":"VLOOKUP(A101,商品信息!A:E,3,0)","v":{"$error":"#N/A"}},null,null,{"$f":"VLOOKUP(A101,入库表!B:H,5,0)","v":{"$error":"#N/A"}},{"$f":"VLOOKUP(A101,入库表!B:H,7,0)","v":{"$error":"#N/A"}},{"$error":"#N/A"},{"$f":"VLOOKUP(A101,出库表!B:H,5,0)","v":{"$error":"#N/A"}},{"$f":"VLOOKUP(A101,出库表!B:H,7,0)","v":{"$error":"#N/A"}},{"$error":"#N/A"},{"$error":"#N/A"},{"$error":"#N/A"}]
[null,{"$f":"VLOOKUP(A102,商品信息!A:E,2,0)","v":{"$error":"#N/A"}},{"$f":"VLOOKUP(A102,商品信息!A:E,3,0)","v":{"$error":"#N/A"}},null,null,{"$f":"VLOOKUP(A102,入库表!B:H,5,0)","v":{"$error":"#N/A"}},{"$f":"VLOOKUP(A102,入库表!B:H,7,0)","v":{"$error":"#N/A"}},{"$error":"#N/A"},{"$f":"VLOOKUP(A102,出库表!B:H,5,0)","v":{"$error":"#N/A"}},{"$f":"VLOOKUP(A102,出库表!B:H,7,0)","v":{"$error":"#N/A"}},{"$error":"#N/A"},{"$error":"#N/A"},{"$error":"#N/A"}]
[null,{"$f":"VLOOKUP(A103,商品信息!A:E,2,0)","v":{"$error":"#N/A"}},{"$f":"VLOOKUP(A103,商品信息!A:E,3,0)","v":{"$error":"#N/A"}},null,null,{"$f":"VLOOKUP(A103,入库表!B:H,5,0)","v":{"$error":"#N/A"}},{"$f":"VLOOKUP(A103,入库表!B:H,7,0)","v":{"$error":"#N/A"}},{"$error":"#N/A"},{"$f":"VLOOKUP(A103,出库表!B:H,5,0)","v":{"$error":"#N/A"}},{"$f":"VLOOKUP(A103,出库表!B:H,7,0)","v":{"$error":"#N/A"}},{"$error":"#N/A"},{"$error":"#N/A"},{"$error":"#N/A"}]
[null,{"$f":"VLOOKUP(A104,商品信息!A:E,2,0)","v":{"$error":"#N/A"}},{"$f":"VLOOKUP(A104,商品信息!A:E,3,0)","v":{"$error":"#N/A"}},null,null,{"$f":"VLOOKUP(A104,入库表!B:H,5,0)","v":{"$error":"#N/A"}},{"$f":"VLOOKUP(A104,入库表!B:H,7,0)","v":{"$error":"#N/A"}},{"$error":"#N/A"},{"$f":"VLOOKUP(A104,出库表!B:H,5,0)","v":{"$error":"#N/A"}},{"$f":"VLOOKUP(A104,出库表!B:H,7,0)","v":{"$error":"#N/A"}},{"$error":"#N/A"},{"$error":"#N/A"},{"$error":"#N/A"}]
[null,{"$f":"VLOOKUP(A105,商品信息!A:E,2,0)","v":{"$error":"#N/A"}},{"$f":"VLOOKUP(A105,商品信息!A:E,3,0)","v":{"$error":"#N/A"}},null,null,{"$f":"VLOOKUP(A105,入库表!B:H,5,0)","v":{"$error":"#N/A"}},{"$f":"VLOOKUP(A105,入库表!B:H,7,0)","v":{"$error":"#N/A"}},{"$error":"#N/A"},{"$f":"VLOOKUP(A105,出库表!B:H,5,0)","v":{"$error":"#N/A"}},{"$f":"VLOOKUP(A105,出库表!B:H,7,0)","v":{"$error":"#N/A"}},{"$error":"#N/A"},{"$error":"#N/A"},{"$error":"#N/A"}]
[null,{"$f":"VLOOKUP(A106,商品信息!A:E,2,0)","v":{"$error":"#N/A"}},{"$f":"VLOOKUP(A106,商品信息!A:E,3,0)","v":{"$error":"#N/A"}},null,null,{"$f":"VLOOKUP(A106,入库表!B:H,5,0)","v":{"$error":"#N/A"}},{"$f":"VLOOKUP(A106,入库表!B:H,7,0)","v":{"$error":"#N/A"}},{"$error":"#N/A"},{"$f":"VLOOKUP(A106,出库表!B:H,5,0)","v":{"$error":"#N/A"}},{"$f":"VLOOKUP(A106,出库表!B:H,7,0)","v":{"$error":"#N/A"}},{"$error":"#N/A"},{"$error":"#N/A"},{"$error":"#N/A"}]
[null,{"$f":"VLOOKUP(A107,商品信息!A:E,2,0)","v":{"$error":"#N/A"}},{"$f":"VLOOKUP(A107,商品信息!A:E,3,0)","v":{"$error":"#N/A"}},null,null,{"$f":"VLOOKUP(A107,入库表!B:H,5,0)","v":{"$error":"#N/A"}},{"$f":"VLOOKUP(A107,入库表!B:H,7,0)","v":{"$error":"#N/A"}},{"$error":"#N/A"},{"$f":"VLOOKUP(A107,出库表!B:H,5,0)","v":{"$error":"#N/A"}},{"$f":"VLOOKUP(A107,出库表!B:H,7,0)","v":{"$error":"#N/A"}},{"$error":"#N/A"},{"$error":"#N/A"},{"$error":"#N/A"}]
[null,{"$f":"VLOOKUP(A108,商品信息!A:E,2,0)","v":{"$error":"#N/A"}},{"$f":"VLOOKUP(A108,商品信息!A:E,3,0)","v":{"$error":"#N/A"}},null,null,{"$f":"VLOOKUP(A108,入库表!B:H,5,0)","v":{"$error":"#N/A"}},{"$f":"VLOOKUP(A108,入库表!B:H,7,0)","v":{"$error":"#N/A"}},{"$error":"#N/A"},{"$f":"VLOOKUP(A108,出库表!B:H,5,0)","v":{"$error":"#N/A"}},{"$f":"VLOOKUP(A108,出库表!B:H,7,0)","v":{"$error":"#N/A"}},{"$error":"#N/A"},{"$error":"#N/A"},{"$error":"#N/A"}]
[null,{"$f":"VLOOKUP(A109,商品信息!A:E,2,0)","v":{"$error":"#N/A"}},{"$f":"VLOOKUP(A109,商品信息!A:E,3,0)","v":{"$error":"#N/A"}},null,null,{"$f":"VLOOKUP(A109,入库表!B:H,5,0)","v":{"$error":"#N/A"}},{"$f":"VLOOKUP(A109,入库表!B:H,7,0)","v":{"$error":"#N/A"}},{"$error":"#N/A"},{"$f":"VLOOKUP(A109,出库表!B:H,5,0)","v":{"$error":"#N/A"}},{"$f":"VLOOKUP(A109,出库表!B:H,7,0)","v":{"$error":"#N/A"}},{"$error":"#N/A"},{"$error":"#N/A"},{"$error":"#N/A"}]
[null,{"$f":"VLOOKUP(A110,商品信息!A:E,2,0)","v":{"$error":"#N/A"}},{"$f":"VLOOKUP(A110,商品信息!A:E,3,0)","v":{"$error":"#N/A"}},null,null,{"$f":"VLOOKUP(A110,入库表!B:H,5,0)","v":{"$error":"#N/A"}},{"$f":"VLOOKUP(A110,入库表!B:H,7,0)","v":{"$error":"#N/A"}},{"$error":"#N/A"},{"$f":"VLOOKUP(A110,出库表!B:H,5,0)","v":{"$error":"#N/A"}},{"$f":"VLOOKUP(A110,出库表!B:H,7,0)","v":{"$error":"#N/A"}},{"$error":"#N/A"},{"$error":"#N/A"},{"$error":"#N/A"}]
[null,{"$f":"VLOOKUP(A111,商品信息!A:E,2,0)","v":{"$error":"#N/A"}},{"$f":"VLOOKUP(A111,商品信息!A:E,3,0)","v":{"$error":"#N/A"}},null,null,{"$f":"VLOOKUP(A111,入库表!B:H,5,0)","v":{"$error":"#N/A"}},{"$f":"VLOOKUP(A111,入库表!B:H,7,0)","v":{"$error":"#N/A"}},{"$error":"#N/A"},{"$f":"VLOOKUP(A111,出库表!B:H,5,0)","v":{"$error":"#N/A"}},{"$f":"VLOOKUP(A111,出库表!B:H,7,0)","v":{"$error":"#N/A"}},{"$error":"#N/A"},{"$error":"#N/A"},{"$error":"#N/A"}]
[null,{"$f":"VLOOKUP(A112,商品信息!A:E,2,0)","v":{"$error":"#N/A"}},{"$f":"VLOOKUP(A112,商品信息!A:E,3,0)","v":{"$error":"#N/A"}},null,null,{"$f":"VLOOKUP(A112,入库表!B:H,5,0)","v":{"$error":"#N/A"}},{"$f":"VLOOKUP(A112,入库表!B:H,7,0)","v":{"$error":"#N/A"}},{"$error":"#N/A"},{"$f":"VLOOKUP(A112,出库表!B:H,5,0)","v":{"$error":"#N/A"}},{"$f":"VLOOKUP(A112,出库表!B:H,7,0)","v":{"$error":"#N/A"}},{"$error":"#N/A"},{"$error":"#N/A"},{"$error":"#N/A"}]
[null,{"$f":"VLOOKUP(A113,商品信息!A:E,2,0)","v":{"$error":"#N/A"}},{"$f":"VLOOKUP(A113,商品信息!A:E,3,0)","v":{"$error":"#N/A"}},null,null,{"$f":"VLOOKUP(A113,入库表!B:H,5,0)","v":{"$error":"#N/A"}},{"$f":"VLOOKUP(A113,入库表!B:H,7,0)","v":{"$error":"#N/A"}},{"$error":"#N/A"},{"$f":"VLOOKUP(A113,出库表!B:H,5,0)","v":{"$error":"#N/A"}},{"$f":"VLOOKUP(A113,出库表!B:H,7,0)","v":{"$error":"#N/A"}},{"$error":"#N/A"},{"$error":"#N/A"},{"$error":"#N/A"}]
[null,{"$f":"VLOOKUP(A114,商品信息!A:E,2,0)","v":{"$error":"#N/A"}},{"$f":"VLOOKUP(A114,商品信息!A:E,3,0)","v":{"$error":"#N/A"}},null,null,{"$f":"VLOOKUP(A114,入库表!B:H,5,0)","v":{"$error":"#N/A"}},{"$f":"VLOOKUP(A114,入库表!B:H,7,0)","v":{"$error":"#N/A"}},{"$error":"#N/A"},{"$f":"VLOOKUP(A114,出库表!B:H,5,0)","v":{"$error":"#N/A"}},{"$f":"VLOOKUP(A114,出库表!B:H,7,0)","v":{"$error":"#N/A"}},{"$error":"#N/A"},{"$error":"#N/A"},{"$error":"#N/A"}]
[null,{"$f":"VLOOKUP(A115,商品信息!A:E,2,0)","v":{"$error":"#N/A"}},{"$f":"VLOOKUP(A115,商品信息!A:E,3,0)","v":{"$error":"#N/A"}},null,null,{"$f":"VLOOKUP(A115,入库表!B:H,5,0)","v":{"$error":"#N/A"}},{"$f":"VLOOKUP(A115,入库表!B:H,7,0)","v":{"$error":"#N/A"}},{"$error":"#N/A"},{"$f":"VLOOKUP(A115,出库表!B:H,5,0)","v":{"$error":"#N/A"}},{"$f":"VLOOKUP(A115,出库表!B:H,7,0)","v":{"$error":"#N/A"}},{"$error":"#N/A"},{"$error":"#N/A"},{"$error":"#N/A"}]
[null,{"$f":"VLOOKUP(A116,商品信息!A:E,2,0)","v":{"$error":"#N/A"}},{"$f":"VLOOKUP(A116,商品信息!A:E,3,0)","v":{"$error":"#N/A"}},null,null,{"$f":"VLOOKUP(A116,入库表!B:H,5,0)","v":{"$error":"#N/A"}},{"$f":"VLOOKUP(A116,入库表!B:H,7,0)","v":{"$error":"#N/A"}},{"$error":"#N/A"},{"$f":"VLOOKUP(A116,出库表!B:H,5,0)","v":{"$error":"#N/A"}},{"$f":"VLOOKUP(A116,出库表!B:H,7,0)","v":{"$error":"#N/A"}},{"$error":"#N/A"},{"$error":"#N/A"},{"$error":"#N/A"}]
[null,{"$f":"VLOOKUP(A117,商品信息!A:E,2,0)","v":{"$error":"#N/A"}},{"$f":"VLOOKUP(A117,商品信息!A:E,3,0)","v":{"$error":"#N/A"}},null,null,{"$f":"VLOOKUP(A117,入库表!B:H,5,0)","v":{"$error":"#N/A"}},{"$f":"VLOOKUP(A117,入库表!B:H,7,0)","v":{"$error":"#N/A"}},{"$error":"#N/A"},{"$f":"VLOOKUP(A117,出库表!B:H,5,0)","v":{"$error":"#N/A"}},{"$f":"VLOOKUP(A117,出库表!B:H,7,0)","v":{"$error":"#N/A"}},{"$error":"#N/A"},{"$error":"#N/A"},{"$error":"#N/A"}]
[null,{"$f":"VLOOKUP(A118,商品信息!A:E,2,0)","v":{"$error":"#N/A"}},{"$f":"VLOOKUP(A118,商品信息!A:E,3,0)","v":{"$error":"#N/A"}},null,null,{"$f":"VLOOKUP(A118,入库表!B:H,5,0)","v":{"$error":"#N/A"}},{"$f":"VLOOKUP(A118,入库表!B:H,7,0)","v":{"$error":"#N/A"}},{"$error":"#N/A"},{"$f":"VLOOKUP(A118,出库表!B:H,5,0)","v":{"$error":"#N/A"}},{"$f":"VLOOKUP(A118,出库表!B:H,7,0)","v":{"$error":"#N/A"}},{"$error":"#N/A"},{"$error":"#N/A"},{"$error":"#N/A"}]
[null,{"$f":"VLOOKUP(A119,商品信息!A:E,2,0)","v":{"$error":"#N/A"}},{"$f":"VLOOKUP(A119,商品信息!A:E,3,0)","v":{"$error":"#N/A"}},null,null,{"$f":"VLOOKUP(A119,入库表!B:H,5,0)","v":{"$error":"#N/A"}},{"$f":"VLOOKUP(A119,入库表!B:H,7,0)","v":{"$error":"#N/A"}},{"$error":"#N/A"},{"$f":"VLOOKUP(A119,出库表!B:H,5,0)","v":{"$error":"#N/A"}},{"$f":"VLOOKUP(A119,出库表!B:H,7,0)","v":{"$error":"#N/A"}},{"$error":"#N/A"},{"$error":"#N/A"},{"$error":"#N/A"}]
[null,{"$f":"VLOOKUP(A120,商品信息!A:E,2,0)","v":{"$error":"#N/A"}},{"$f":"VLOOKUP(A120,商品信息!A:E,3,0)","v":{"$error":"#N/A"}},null,null,{"$f":"VLOOKUP(A120,入库表!B:H,5,0)","v":{"$error":"#N/A"}},{"$f":"VLOOKUP(A120,入库表!B:H,7,0)","v":{"$error":"#N/A"}},{"$error":"#N/A"},{"$f":"VLOOKUP(A120,出库表!B:H,5,0)","v":{"$error":"#N/A"}},{"$f":"VLOOKUP(A120,出库表!B:H,7,0)","v":{"$error":"#N/A"}},{"$error":"#N/A"},{"$error":"#N/A"},{"$error":"#N/A"}]
[null,{"$f":"VLOOKUP(A121,商品信息!A:E,2,0)","v":{"$error":"#N/A"}},{"$f":"VLOOKUP(A121,商品信息!A:E,3,0)","v":{"$error":"#N/A"}},null,null,{"$f":"VLOOKUP(A121,入库表!B:H,5,0)","v":{"$error":"#N/A"}},{"$f":"VLOOKUP(A121,入库表!B:H,7,0)","v":{"$error":"#N/A"}},{"$error":"#N/A"},{"$f":"VLOOKUP(A121,出库表!B:H,5,0)","v":{"$error":"#N/A"}},{"$f":"VLOOKUP(A121,出库表!B:H,7,0)","v":{"$error":"#N/A"}},{"$error":"#N/A"},{"$error":"#N/A"},{"$error":"#N/A"}]
[null,{"$f":"VLOOKUP(A122,商品信息!A:E,2,0)","v":{"$error":"#N/A"}},{"$f":"VLOOKUP(A122,商品信息!A:E,3,0)","v":{"$error":"#N/A"}},null,null,{"$f":"VLOOKUP(A122,入库表!B:H,5,0)","v":{"$error":"#N/A"}},{"$f":"VLOOKUP(A122,入库表!B:H,7,0)","v":{"$error":"#N/A"}},{"$error":"#N/A"},{"$f":"VLOOKUP(A122,出库表!B:H,5,0)","v":{"$error":"#N/A"}},{"$f":"VLOOKUP(A122,出库表!B:H,7,0)","v":{"$error":"#N/A"}},{"$error":"#N/A"},{"$error":"#N/A"},{"$error":"#N/A"}]
[null,{"$f":"VLOOKUP(A123,商品信息!A:E,2,0)","v":{"$error":"#N/A"}},{"$f":"VLOOKUP(A123,商品信息!A:E,3,0)","v":{"$error":"#N/A"}},null,null,{"$f":"VLOOKUP(A123,入库表!B:H,5,0)","v":{"$error":"#N/A"}},{"$f":"VLOOKUP(A123,入库表!B:H,7,0)","v":{"$error":"#N/A"}},{"$error":"#N/A"},{"$f":"VLOOKUP(A123,出库表!B:H,5,0)","v":{"$error":"#N/A"}},{"$f":"VLOOKUP(A123,出库表!B:H,7,0)","v":{"$error":"#N/A"}},{"$error":"#N/A"},{"$error":"#N/A"},{"$error":"#N/A"}]
[null,{"$f":"VLOOKUP(A124,商品信息!A:E,2,0)","v":{"$error":"#N/A"}},{"$f":"VLOOKUP(A124,商品信息!A:E,3,0)","v":{"$error":"#N/A"}},null,null,{"$f":"VLOOKUP(A124,入库表!B:H,5,0)","v":{"$error":"#N/A"}},{"$f":"VLOOKUP(A124,入库表!B:H,7,0)","v":{"$error":"#N/A"}},{"$error":"#N/A"},{"$f":"VLOOKUP(A124,出库表!B:H,5,0)","v":{"$error":"#N/A"}},{"$f":"VLOOKUP(A124,出库表!B:H,7,0)","v":{"$error":"#N/A"}},{"$error":"#N/A"},{"$error":"#N/A"},{"$error":"#N/A"}]
[null,{"$f":"VLOOKUP(A125,商品信息!A:E,2,0)","v":{"$error":"#N/A"}},{"$f":"VLOOKUP(A125,商品信息!A:E,3,0)","v":{"$error":"#N/A"}},null,null,{"$f":"VLOOKUP(A125,入库表!B:H,5,0)","v":{"$error":"#N/A"}},{"$f":"VLOOKUP(A125,入库表!B:H,7,0)","v":{"$error":"#N/A"}},{"$error":"#N/A"},{"$f":"VLOOKUP(A125,出库表!B:H,5,0)","v":{"$error":"#N/A"}},{"$f":"VLOOKUP(A125,出库表!B:H,7,0)","v":{"$error":"#N/A"}},{"$error":"#N/A"},{"$error":"#N/A"},{"$error":"#N/A"}]
[null,{"$f":"VLOOKUP(A126,商品信息!A:E,2,0)","v":{"$error":"#N/A"}},{"$f":"VLOOKUP(A126,商品信息!A:E,3,0)","v":{"$error":"#N/A"}},null,null,{"$f":"VLOOKUP(A126,入库表!B:H,5,0)","v":{"$error":"#N/A"}},{"$f":"VLOOKUP(A126,入库表!B:H,7,0)","v":{"$error":"#N/A"}},{"$error":"#N/A"},{"$f":"VLOOKUP(A126,出库表!B:H,5,0)","v":{"$error":"#N/A"}},{"$f":"VLOOKUP(A126,出库表!B:H,7,0)","v":{"$error":"#N/A"}},{"$error":"#N/A"},{"$error":"#N/A"},{"$error":"#N/A"}]
[null,{"$f":"VLOOKUP(A127,商品信息!A:E,2,0)","v":{"$error":"#N/A"}},{"$f":"VLOOKUP(A127,商品信息!A:E,3,0)","v":{"$error":"#N/A"}},null,null,{"$f":"VLOOKUP(A127,入库表!B:H,5,0)","v":{"$error":"#N/A"}},{"$f":"VLOOKUP(A127,入库表!B:H,7,0)","v":{"$error":"#N/A"}},{"$error":"#N/A"},{"$f":"VLOOKUP(A127,出库表!B:H,5,0)","v":{"$error":"#N/A"}},{"$f":"VLOOKUP(A127,出库表!B:H,7,0)","v":{"$error":"#N/A"}},{"$error":"#N/A"},{"$error":"#N/A"},{"$error":"#N/A"}]
[null,{"$f":"VLOOKUP(A128,商品信息!A:E,2,0)","v":{"$error":"#N/A"}},{"$f":"VLOOKUP(A128,商品信息!A:E,3,0)","v":{"$error":"#N/A"}},null,null,{"$f":"VLOOKUP(A128,入库表!B:H,5,0)","v":{"$error":"#N/A"}},{"$f":"VLOOKUP(A128,入库表!B:H,7,0)","v":{"$error":"#N/A"}},{"$error":"#N/A"},{"$f":"VLOOKUP(A128,出库表!B:H,5,0)","v":{"$error":"#N/A"}},{"$f":"VLOOKUP(A128,出库表!B:H,7,0)","v":{"$error":"#N/A"}},{"$error":"#N/A"},{"$error":"#N/A"},{"$error":"#N/A"}]
[null,{"$f":"VLOOKUP(A129,商品信息!A:E,2,0)","v":{"$error":"#N/A"}},{"$f":"VLOOKUP(A129,商品信息!A:E,3,0)","v":{"$error":"#N/A"}},null,null,{"$f":"VLOOKUP(A129,入库表!B:H,5,0)","v":{"$error":"#N/A"}},{"$f":"VLOOKUP(A129,入库表!B:H,7,0)","v":{"$error":"#N/A"}},{"$error":"#N/A"},{"$f":"VLOOKUP(A129,出库表!B:H,5,0)","v":{"$error":"#N/A"}},{"$f":"VLOOKUP(A129,出库表!B:H,7,0)","v":{"$error":"#N/A"}},{"$error":"#N/A"},{"$error":"#N/A"},{"$error":"#N/A"}]
[null,{"$f":"VLOOKUP(A130,商品信息!A:E,2,0)","v":{"$error":"#N/A"}},{"$f":"VLOOKUP(A130,商品信息!A:E,3,0)","v":{"$error":"#N/A"}},null,null,{"$f":"VLOOKUP(A130,入库表!B:H,5,0)","v":{"$error":"#N/A"}},{"$f":"VLOOKUP(A130,入库表!B:H,7,0)","v":{"$error":"#N/A"}},{"$error":"#N/A"},{"$f":"VLOOKUP(A130,出库表!B:H,5,0)","v":{"$error":"#N/A"}},{"$f":"VLOOKUP(A130,出库表!B:H,7,0)","v":{"$error":"#N/A"}},{"$error":"#N/A"},{"$error":"#N/A"},{"$error":"#N/A"}]
[null,{"$f":"VLOOKUP(A131,商品信息!A:E,2,0)","v":{"$error":"#N/A"}},{"$f":"VLOOKUP(A131,商品信息!A:E,3,0)","v":{"$error":"#N/A"}},null,null,{"$f":"VLOOKUP(A131,入库表!B:H,5,0)","v":{"$error":"#N/A"}},{"$f":"VLOOKUP(A131,入库表!B:H,7,0)","v":{"$error":"#N/A"}},{"$f":"F131*G131","v":{"$error":"#N/A"}},{"$f":"VLOOKUP(A131,出库表!B:H,5,0)","v":{"$error":"#N/A"}},{"$f":"VLOOKUP(A131,出库表!B:H,7,0)","v":{"$error":"#N/A"}},{"$error":"#N/A"},{"$error":"#N/A"},{"$error":"#N/A"}]
[null,{"$f":"VLOOKUP(A132,商品信息!A:E,2,0)","v":{"$error":"#N/A"}},{"$f":"VLOOKUP(A132,商品信息!A:E,3,0)","v":{"$error":"#N/A"}},null,null,{"$f":"VLOOKUP(A132,入库表!B:H,5,0)","v":{"$error":"#N/A"}},{"$f":"VLOOKUP(A132,入库表!B:H,7,0)","v":{"$error":"#N/A"}},{"$error":"#N/A"},{"$f":"VLOOKUP(A132,出库表!B:H,5,0)","v":{"$error":"#N/A"}},{"$f":"VLOOKUP(A132,出库表!B:H,7,0)","v":{"$error":"#N/A"}},{"$f":"I132*J132","v":{"$error":"#N/A"}},{"$f":"F132-I132","v":{"$error":"#N/A"}},{"$f":"I132*(J132-G132)","v":{"$error":"#N/A"}}]
[null,{"$f":"VLOOKUP(A133,商品信息!A:E,2,0)","v":{"$error":"#N/A"}},{"$f":"VLOOKUP(A133,商品信息!A:E,3,0)","v":{"$error":"#N/A"}},null,null,{"$f":"VLOOKUP(A133,入库表!B:H,5,0)","v":{"$error":"#N/A"}},{"$f":"VLOOKUP(A133,入库表!B:H,7,0)","v":{"$error":"#N/A"}},{"$error":"#N/A"},{"$f":"VLOOKUP(A133,出库表!B:H,5,0)","v":{"$error":"#N/A"}},{"$f":"VLOOKUP(A133,出库表!B:H,7,0)","v":{"$error":"#N/A"}},{"$error":"#N/A"},{"$error":"#N/A"},{"$error":"#N/A"}]
[null,{"$f":"VLOOKUP(A134,商品信息!A:E,2,0)","v":{"$error":"#N/A"}},{"$f":"VLOOKUP(A134,商品信息!A:E,3,0)","v":{"$error":"#N/A"}},null,null,{"$f":"VLOOKUP(A134,入库表!B:H,5,0)","v":{"$error":"#N/A"}},{"$f":"VLOOKUP(A134,入库表!B:H,7,0)","v":{"$error":"#N/A"}},{"$error":"#N/A"},{"$f":"VLOOKUP(A134,出库表!B:H,5,0)","v":{"$error":"#N/A"}},{"$f":"VLOOKUP(A134,出库表!B:H,7,0)","v":{"$error":"#N/A"}},{"$error":"#N/A"},{"$error":"#N/A"},{"$error":"#N/A"}]
[null,{"$f":"VLOOKUP(A135,商品信息!A:E,2,0)","v":{"$error":"#N/A"}},{"$f":"VLOOKUP(A135,商品信息!A:E,3,0)","v":{"$error":"#N/A"}},null,null,{"$f":"VLOOKUP(A135,入库表!B:H,5,0)","v":{"$error":"#N/A"}},{"$f":"VLOOKUP(A135,入库表!B:H,7,0)","v":{"$error":"#N/A"}},{"$error":"#N/A"},{"$f":"VLOOKUP(A135,出库表!B:H,5,0)","v":{"$error":"#N/A"}},{"$f":"VLOOKUP(A135,出库表!B:H,7,0)","v":{"$error":"#N/A"}},{"$error":"#N/A"},{"$error":"#N/A"},{"$error":"#N/A"}]
[null,{"$f":"VLOOKUP(A136,商品信息!A:E,2,0)","v":{"$error":"#N/A"}},{"$f":"VLOOKUP(A136,商品信息!A:E,3,0)","v":{"$error":"#N/A"}},null,null,{"$f":"VLOOKUP(A136,入库表!B:H,5,0)","v":{"$error":"#N/A"}},{"$f":"VLOOKUP(A136,入库表!B:H,7,0)","v":{"$error":"#N/A"}},{"$error":"#N/A"},{"$f":"VLOOKUP(A136,出库表!B:H,5,0)","v":{"$error":"#N/A"}},{"$f":"VLOOKUP(A136,出库表!B:H,7,0)","v":{"$error":"#N/A"}},{"$error":"#N/A"},{"$error":"#N/A"},{"$error":"#N/A"}]
[null,{"$f":"VLOOKUP(A137,商品信息!A:E,2,0)","v":{"$error":"#N/A"}},{"$f":"VLOOKUP(A137,商品信息!A:E,3,0)","v":{"$error":"#N/A"}},null,null,{"$f":"VLOOKUP(A137,入库表!B:H,5,0)","v":{"$error":"#N/A"}},{"$f":"VLOOKUP(A137,入库表!B:H,7,0)","v":{"$error":"#N/A"}},{"$error":"#N/A"},{"$f":"VLOOKUP(A137,出库表!B:H,5,0)","v":{"$error":"#N/A"}},{"$f":"VLOOKUP(A137,出库表!B:H,7,0)","v":{"$error":"#N/A"}},{"$error":"#N/A"},{"$error":"#N/A"},{"$error":"#N/A"}]
[null,{"$f":"VLOOKUP(A138,商品信息!A:E,2,0)","v":{"$error":"#N/A"}},{"$f":"VLOOKUP(A138,商品信息!A:E,3,0)","v":{"$error":"#N/A"}},null,null,{"$f":"VLOOKUP(A138,入库表!B:H,5,0)","v":{"$error":"#N/A"}},{"$f":"VLOOKUP(A138,入库表!B:H,7,0)","v":{"$error":"#N/A"}},{"$error":"#N/A"},{"$f":"VLOOKUP(A138,出库表!B:H,5,0)","v":{"$error":"#N/A"}},{"$f":"VLOOKUP(A138,出库表!B:H,7,0)","v":{"$error":"#N/A"}},{"$error":"#N/A"},{"$error":"#N/A"},{"$error":"#N/A"}]
[null,{"$f":"VLOOKUP(A139,商品信息!A:E,2,0)","v":{"$error":"#N/A"}},{"$f":"VLOOKUP(A139,商品信息!A:E,3,0)","v":{"$error":"#N/A"}},null,null,{"$f":"VLOOKUP(A139,入库表!B:H,5,0)","v":{"$error":"#N/A"}},{"$f":"VLOOKUP(A139,入库表!B:H,7,0)","v":{"$error":"#N/A"}},{"$error":"#N/A"},{"$f":"VLOOKUP(A139,出库表!B:H,5,0)","v":{"$error":"#N/A"}},{"$f":"VLOOKUP(A139,出库表!B:H,7,0)","v":{"$error":"#N/A"}},{"$error":"#N/A"},{"$error":"#N/A"},{"$error":"#N/A"}]
[null,{"$f":"VLOOKUP(A140,商品信息!A:E,2,0)","v":{"$error":"#N/A"}},{"$f":"VLOOKUP(A140,商品信息!A:E,3,0)","v":{"$error":"#N/A"}},null,null,{"$f":"VLOOKUP(A140,入库表!B:H,5,0)","v":{"$error":"#N/A"}},{"$f":"VLOOKUP(A140,入库表!B:H,7,0)","v":{"$error":"#N/A"}},{"$error":"#N/A"},{"$f":"VLOOKUP(A140,出库表!B:H,5,0)","v":{"$error":"#N/A"}},{"$f":"VLOOKUP(A140,出库表!B:H,7,0)","v":{"$error":"#N/A"}},{"$error":"#N/A"},{"$error":"#N/A"},{"$error":"#N/A"}]
[null,{"$f":"VLOOKUP(A141,商品信息!A:E,2,0)","v":{"$error":"#N/A"}},{"$f":"VLOOKUP(A141,商品信息!A:E,3,0)","v":{"$error":"#N/A"}},null,null,{"$f":"VLOOKUP(A141,入库表!B:H,5,0)","v":{"$error":"#N/A"}},{"$f":"VLOOKUP(A141,入库表!B:H,7,0)","v":{"$error":"#N/A"}},{"$error":"#N/A"},{"$f":"VLOOKUP(A141,出库表!B:H,5,0)","v":{"$error":"#N/A"}},{"$f":"VLOOKUP(A141,出库表!B:H,7,0)","v":{"$error":"#N/A"}},{"$error":"#N/A"},{"$error":"#N/A"},{"$error":"#N/A"}]
[null,{"$f":"VLOOKUP(A142,商品信息!A:E,2,0)","v":{"$error":"#N/A"}},{"$f":"VLOOKUP(A142,商品信息!A:E,3,0)","v":{"$error":"#N/A"}},null,null,{"$f":"VLOOKUP(A142,入库表!B:H,5,0)","v":{"$error":"#N/A"}},{"$f":"VLOOKUP(A142,入库表!B:H,7,0)","v":{"$error":"#N/A"}},{"$error":"#N/A"},{"$f":"VLOOKUP(A142,出库表!B:H,5,0)","v":{"$error":"#N/A"}},{"$f":"VLOOKUP(A142,出库表!B:H,7,0)","v":{"$error":"#N/A"}},{"$error":"#N/A"},{"$error":"#N/A"},{"$error":"#N/A"}]
[null,{"$f":"VLOOKUP(A143,商品信息!A:E,2,0)","v":{"$error":"#N/A"}},{"$f":"VLOOKUP(A143,商品信息!A:E,3,0)","v":{"$error":"#N/A"}},null,null,{"$f":"VLOOKUP(A143,入库表!B:H,5,0)","v":{"$error":"#N/A"}},{"$f":"VLOOKUP(A143,入库表!B:H,7,0)","v":{"$error":"#N/A"}},{"$error":"#N/A"},{"$f":"VLOOKUP(A143,出库表!B:H,5,0)","v":{"$error":"#N/A"}},{"$f":"VLOOKUP(A143,出库表!B:H,7,0)","v":{"$error":"#N/A"}},{"$error":"#N/A"},{"$error":"#N/A"},{"$error":"#N/A"}]
[null,{"$f":"VLOOKUP(A144,商品信息!A:E,2,0)","v":{"$error":"#N/A"}},{"$f":"VLOOKUP(A144,商品信息!A:E,3,0)","v":{"$error":"#N/A"}},null,null,{"$f":"VLOOKUP(A144,入库表!B:H,5,0)","v":{"$error":"#N/A"}},{"$f":"VLOOKUP(A144,入库表!B:H,7,0)","v":{"$error":"#N/A"}},{"$error":"#N/A"},{"$f":"VLOOKUP(A144,出库表!B:H,5,0)","v":{"$error":"#N/A"}},{"$f":"VLOOKUP(A144,出库表!B:H,7,0)","v":{"$error":"#N/A"}},{"$error":"#N/A"},{"$error":"#N/A"},{"$error":"#N/A"}]
[null,{"$f":"VLOOKUP(A145,商品信息!A:E,2,0)","v":{"$error":"#N/A"}},{"$f":"VLOOKUP(A145,商品信息!A:E,3,0)","v":{"$error":"#N/A"}},null,null,{"$f":"VLOOKUP(A145,入库表!B:H,5,0)","v":{"$error":"#N/A"}},{"$f":"VLOOKUP(A145,入库表!B:H,7,0)","v":{"$error":"#N/A"}},{"$error":"#N/A"},{"$f":"VLOOKUP(A145,出库表!B:H,5,0)","v":{"$error":"#N/A"}},{"$f":"VLOOKUP(A145,出库表!B:H,7,0)","v":{"$error":"#N/A"}},{"$error":"#N/A"},{"$error":"#N/A"},{"$error":"#N/A"}]
[null,{"$f":"VLOOKUP(A146,商品信息!A:E,2,0)","v":{"$error":"#N/A"}},{"$f":"VLOOKUP(A146,商品信息!A:E,3,0)","v":{"$error":"#N/A"}},null,null,{"$f":"VLOOKUP(A146,入库表!B:H,5,0)","v":{"$error":"#N/A"}},{"$f":"VLOOKUP(A146,入库表!B:H,7,0)","v":{"$error":"#N/A"}},{"$error":"#N/A"},{"$f":"VLOOKUP(A146,出库表!B:H,5,0)","v":{"$error":"#N/A"}},{"$f":"VLOOKUP(A146,出库表!B:H,7,0)","v":{"$error":"#N/A"}},{"$error":"#N/A"},{"$error":"#N/A"},{"$error":"#N/A"}]
[null,{"$f":"VLOOKUP(A147,商品信息!A:E,2,0)","v":{"$error":"#N/A"}},{"$f":"VLOOKUP(A147,商品信息!A:E,3,0)","v":{"$error":"#N/A"}},null,null,{"$f":"VLOOKUP(A147,入库表!B:H,5,0)","v":{"$error":"#N/A"}},{"$f":"VLOOKUP(A147,入库表!B:H,7,0)","v":{"$error":"#N/A"}},{"$error":"#N/A"},{"$f":"VLOOKUP(A147,出库表!B:H,5,0)","v":{"$error":"#N/A"}},{"$f":"VLOOKUP(A147,出库表!B:H,7,0)","v":{"$error":"#N/A"}},{"$error":"#N/A"},{"$error":"#N/A"},{"$error":"#N/A"}]
[null,{"$f":"VLOOKUP(A148,商品信息!A:E,2,0)","v":{"$error":"#N/A"}},{"$f":"VLOOKUP(A148,商品信息!A:E,3,0)","v":{"$error":"#N/A"}},null,null,{"$f":"VLOOKUP(A148,入库表!B:H,5,0)","v":{"$error":"#N/A"}},{"$f":"VLOOKUP(A148,入库表!B:H,7,0)","v":{"$error":"#N/A"}},{"$error":"#N/A"},{"$f":"VLOOKUP(A148,出库表!B:H,5,0)","v":{"$error":"#N/A"}},{"$f":"VLOOKUP(A148,出库表!B:H,7,0)","v":{"$error":"#N/A"}},{"$error":"#N/A"},{"$error":"#N/A"},{"$error":"#N/A"}]
[null,{"$f":"VLOOKUP(A149,商品信息!A:E,2,0)","v":{"$error":"#N/A"}},{"$f":"VLOOKUP(A149,商品信息!A:E,3,0)","v":{"$error":"#N/A"}},null,null,{"$f":"VLOOKUP(A149,入库表!B:H,5,0)","v":{"$error":"#N/A"}},{"$f":"VLOOKUP(A149,入库表!B:H,7,0)","v":{"$error":"#N/A"}},{"$error":"#N/A"},{"$f":"VLOOKUP(A149,出库表!B:H,5,0)","v":{"$error":"#N/A"}},{"$f":"VLOOKUP(A149,出库表!B:H,7,0)","v":{"$error":"#N/A"}},{"$error":"#N/A"},{"$error":"#N/A"},{"$error":"#N/A"}]
[null,{"$f":"VLOOKUP(A150,商品信息!A:E,2,0)","v":{"$error":"#N/A"}},{"$f":"VLOOKUP(A150,商品信息!A:E,3,0)","v":{"$error":"#N/A"}},null,null,{"$f":"VLOOKUP(A150,入库表!B:H,5,0)","v":{"$error":"#N/A"}},{"$f":"VLOOKUP(A150,入库表!B:H,7,0)","v":{"$error":"#N/A"}},{"$error":"#N/A"},{"$f":"VLOOKUP(A150,出库表!B:H,5,0)","v":{"$error":"#N/A"}},{"$f":"VLOOKUP(A150,出库表!B:H,7,0)","v":{"$error":"#N/A"}},{"$error":"#N/A"},{"$error":"#N/A"},{"$error":"#N/A"}]
[null,{"$f":"VLOOKUP(A151,商品信息!A:E,2,0)","v":{"$error":"#N/A"}},{"$f":"VLOOKUP(A151,商品信息!A:E,3,0)","v":{"$error":"#N/A"}},null,null,{"$f":"VLOOKUP(A151,入库表!B:H,5,0)","v":{"$error":"#N/A"}},{"$f":"VLOOKUP(A151,入库表!B:H,7,0)","v":{"$error":"#N/A"}},{"$error":"#N/A"},{"$f":"VLOOKUP(A151,出库表!B:H,5,0)","v":{"$error":"#N/A"}},{"$f":"VLOOKUP(A151,出库表!B:H,7,0)","v":{"$error":"#N/A"}},{"$error":"#N/A"},{"$error":"#N/A"},{"$error":"#N/A"}]
[null,{"$f":"VLOOKUP(A152,商品信息!A:E,2,0)","v":{"$error":"#N/A"}},{"$f":"VLOOKUP(A152,商品信息!A:E,3,0)","v":{"$error":"#N/A"}},null,null,{"$f":"VLOOKUP(A152,入库表!B:H,5,0)","v":{"$error":"#N/A"}},{"$f":"VLOOKUP(A152,入库表!B:H,7,0)","v":{"$error":"#N/A"}},{"$error":"#N/A"},{"$f":"VLOOKUP(A152,出库表!B:H,5,0)","v":{"$error":"#N/A"}},{"$f":"VLOOKUP(A152,出库表!B:H,7,0)","v":{"$error":"#N/A"}},{"$error":"#N/A"},{"$error":"#N/A"},{"$error":"#N/A"}]
[null,{"$f":"VLOOKUP(A153,商品信息!A:E,2,0)","v":{"$error":"#N/A"}},{"$f":"VLOOKUP(A153,商品信息!A:E,3,0)","v":{"$error":"#N/A"}},null,null,{"$f":"VLOOKUP(A153,入库表!B:H,5,0)","v":{"$error":"#N/A"}},{"$f":"VLOOKUP(A153,入库表!B:H,7,0)","v":{"$error":"#N/A"}},{"$error":"#N/A"},{"$f":"VLOOKUP(A153,出库表!B:H,5,0)","v":{"$error":"#N/A"}},{"$f":"VLOOKUP(A153,出库表!B:H,7,0)","v":{"$error":"#N/A"}},{"$error":"#N/A"},{"$error":"#N/A"},{"$error":"#N/A"}]
[null,{"$f":"VLOOKUP(A154,商品信息!A:E,2,0)","v":{"$error":"#N/A"}},{"$f":"VLOOKUP(A154,商品信息!A:E,3,0)","v":{"$error":"#N/A"}},null,null,{"$f":"VLOOKUP(A154,入库表!B:H,5,0)","v":{"$error":"#N/A"}},{"$f":"VLOOKUP(A154,入库表!B:H,7,0)","v":{"$error":"#N/A"}},{"$error":"#N/A"},{"$f":"VLOOKUP(A154,出库表!B:H,5,0)","v":{"$error":"#N/A"}},{"$f":"VLOOKUP(A154,出库表!B:H,7,0)","v":{"$error":"#N/A"}},{"$error":"#N/A"},{"$error":"#N/A"},{"$error":"#N/A"}]
[null,{"$f":"VLOOKUP(A155,商品信息!A:E,2,0)","v":{"$error":"#N/A"}},{"$f":"VLOOKUP(A155,商品信息!A:E,3,0)","v":{"$error":"#N/A"}},null,null,{"$f":"VLOOKUP(A155,入库表!B:H,5,0)","v":{"$error":"#N/A"}},{"$f":"VLOOKUP(A155,入库表!B:H,7,0)","v":{"$error":"#N/A"}},{"$error":"#N/A"},{"$f":"VLOOKUP(A155,出库表!B:H,5,0)","v":{"$error":"#N/A"}},{"$f":"VLOOKUP(A155,出库表!B:H,7,0)","v":{"$error":"#N/A"}},{"$error":"#N/A"},{"$error":"#N/A"},{"$error":"#N/A"}]
[null,{"$f":"VLOOKUP(A156,商品信息!A:E,2,0)","v":{"$error":"#N/A"}},{"$f":"VLOOKUP(A156,商品信息!A:E,3,0)","v":{"$error":"#N/A"}},null,null,{"$f":"VLOOKUP(A156,入库表!B:H,5,0)","v":{"$error":"#N/A"}},{"$f":"VLOOKUP(A156,入库表!B:H,7,0)","v":{"$error":"#N/A"}},{"$error":"#N/A"},{"$f":"VLOOKUP(A156,出库表!B:H,5,0)","v":{"$error":"#N/A"}},{"$f":"VLOOKUP(A156,出库表!B:H,7,0)","v":{"$error":"#N/A"}},{"$error":"#N/A"},{"$error":"#N/A"},{"$error":"#N/A"}]
[null,{"$f":"VLOOKUP(A157,商品信息!A:E,2,0)","v":{"$error":"#N/A"}},{"$f":"VLOOKUP(A157,商品信息!A:E,3,0)","v":{"$error":"#N/A"}},null,null,{"$f":"VLOOKUP(A157,入库表!B:H,5,0)","v":{"$error":"#N/A"}},{"$f":"VLOOKUP(A157,入库表!B:H,7,0)","v":{"$error":"#N/A"}},{"$error":"#N/A"},{"$f":"VLOOKUP(A157,出库表!B:H,5,0)","v":{"$error":"#N/A"}},{"$f":"VLOOKUP(A157,出库表!B:H,7,0)","v":{"$error":"#N/A"}},{"$error":"#N/A"},{"$error":"#N/A"},{"$error":"#N/A"}]
[null,{"$f":"VLOOKUP(A158,商品信息!A:E,2,0)","v":{"$error":"#N/A"}},{"$f":"VLOOKUP(A158,商品信息!A:E,3,0)","v":{"$error":"#N/A"}},null,null,{"$f":"VLOOKUP(A158,入库表!B:H,5,0)","v":{"$error":"#N/A"}},{"$f":"VLOOKUP(A158,入库表!B:H,7,0)","v":{"$error":"#N/A"}},{"$error":"#N/A"},{"$f":"VLOOKUP(A158,出库表!B:H,5,0)","v":{"$error":"#N/A"}},{"$f":"VLOOKUP(A158,出库表!B:H,7,0)","v":{"$error":"#N/A"}},{"$error":"#N/A"},{"$error":"#N/A"},{"$error":"#N/A"}]
[null,{"$f":"VLOOKUP(A159,商品信息!A:E,2,0)","v":{"$error":"#N/A"}},{"$f":"VLOOKUP(A159,商品信息!A:E,3,0)","v":{"$error":"#N/A"}},null,null,{"$f":"VLOOKUP(A159,入库表!B:H,5,0)","v":{"$error":"#N/A"}},{"$f":"VLOOKUP(A159,入库表!B:H,7,0)","v":{"$error":"#N/A"}},{"$error":"#N/A"},{"$f":"VLOOKUP(A159,出库表!B:H,5,0)","v":{"$error":"#N/A"}},{"$f":"VLOOKUP(A159,出库表!B:H,7,0)","v":{"$error":"#N/A"}},{"$error":"#N/A"},{"$error":"#N/A"},{"$error":"#N/A"}]
[null,{"$f":"VLOOKUP(A160,商品信息!A:E,2,0)","v":{"$error":"#N/A"}},{"$f":"VLOOKUP(A160,商品信息!A:E,3,0)","v":{"$error":"#N/A"}},null,null,{"$f":"VLOOKUP(A160,入库表!B:H,5,0)","v":{"$error":"#N/A"}},{"$f":"VLOOKUP(A160,入库表!B:H,7,0)","v":{"$error":"#N/A"}},{"$error":"#N/A"},{"$f":"VLOOKUP(A160,出库表!B:H,5,0)","v":{"$error":"#N/A"}},{"$f":"VLOOKUP(A160,出库表!B:H,7,0)","v":{"$error":"#N/A"}},{"$error":"#N/A"},{"$error":"#N/A"},{"$error":"#N/A"}]
[null,{"$f":"VLOOKUP(A161,商品信息!A:E,2,0)","v":{"$error":"#N/A"}},{"$f":"VLOOKUP(A161,商品信息!A:E,3,0)","v":{"$error":"#N/A"}},null,null,{"$f":"VLOOKUP(A161,入库表!B:H,5,0)","v":{"$error":"#N/A"}},{"$f":"VLOOKUP(A161,入库表!B:H,7,0)","v":{"$error":"#N/A"}},{"$error":"#N/A"},{"$f":"VLOOKUP(A161,出库表!B:H,5,0)","v":{"$error":"#N/A"}},{"$f":"VLOOKUP(A161,出库表!B:H,7,0)","v":{"$error":"#N/A"}},{"$error":"#N/A"},{"$error":"#N/A"},{"$error":"#N/A"}]
[null,{"$f":"VLOOKUP(A162,商品信息!A:E,2,0)","v":{"$error":"#N/A"}},{"$f":"VLOOKUP(A162,商品信息!A:E,3,0)","v":{"$error":"#N/A"}},null,null,{"$f":"VLOOKUP(A162,入库表!B:H,5,0)","v":{"$error":"#N/A"}},{"$f":"VLOOKUP(A162,入库表!B:H,7,0)","v":{"$error":"#N/A"}},{"$error":"#N/A"},{"$f":"VLOOKUP(A162,出库表!B:H,5,0)","v":{"$error":"#N/A"}},{"$f":"VLOOKUP(A162,出库表!B:H,7,0)","v":{"$error":"#N/A"}},{"$error":"#N/A"},{"$error":"#N/A"},{"$error":"#N/A"}]
[null,{"$f":"VLOOKUP(A163,商品信息!A:E,2,0)","v":{"$error":"#N/A"}},{"$f":"VLOOKUP(A163,商品信息!A:E,3,0)","v":{"$error":"#N/A"}},null,null,{"$f":"VLOOKUP(A163,入库表!B:H,5,0)","v":{"$error":"#N/A"}},{"$f":"VLOOKUP(A163,入库表!B:H,7,0)","v":{"$error":"#N/A"}},{"$error":"#N/A"},{"$f":"VLOOKUP(A163,出库表!B:H,5,0)","v":{"$error":"#N/A"}},{"$f":"VLOOKUP(A163,出库表!B:H,7,0)","v":{"$error":"#N/A"}},{"$error":"#N/A"},{"$error":"#N/A"},{"$error":"#N/A"}]
[null,{"$f":"VLOOKUP(A164,商品信息!A:E,2,0)","v":{"$error":"#N/A"}},{"$f":"VLOOKUP(A164,商品信息!A:E,3,0)","v":{"$error":"#N/A"}},null,null,{"$f":"VLOOKUP(A164,入库表!B:H,5,0)","v":{"$error":"#N/A"}},{"$f":"VLOOKUP(A164,入库表!B:H,7,0)","v":{"$error":"#N/A"}},{"$error":"#N/A"},{"$f":"VLOOKUP(A164,出库表!B:H,5,0)","v":{"$error":"#N/A"}},{"$f":"VLOOKUP(A164,出库表!B:H,7,0)","v":{"$error":"#N/A"}},{"$error":"#N/A"},{"$error":"#N/A"},{"$error":"#N/A"}]
[null,{"$f":"VLOOKUP(A165,商品信息!A:E,2,0)","v":{"$error":"#N/A"}},{"$f":"VLOOKUP(A165,商品信息!A:E,3,0)","v":{"$error":"#N/A"}},null,null,{"$f":"VLOOKUP(A165,入库表!B:H,5,0)","v":{"$error":"#N/A"}},{"$f":"VLOOKUP(A165,入库表!B:H,7,0)","v":{"$error":"#N/A"}},{"$error":"#N/A"},{"$f":"VLOOKUP(A165,出库表!B:H,5,0)","v":{"$error":"#N/A"}},{"$f":"VLOOKUP(A165,出库表!B:H,7,0)","v":{"$error":"#N/A"}},{"$error":"#N/A"},{"$error":"#N/A"},{"$error":"#N/A"}]
[null,{"$f":"VLOOKUP(A166,商品信息!A:E,2,0)","v":{"$error":"#N/A"}},{"$f":"VLOOKUP(A166,商品信息!A:E,3,0)","v":{"$error":"#N/A"}},null,null,{"$f":"VLOOKUP(A166,入库表!B:H,5,0)","v":{"$error":"#N/A"}},{"$f":"VLOOKUP(A166,入库表!B:H,7,0)","v":{"$error":"#N/A"}},{"$error":"#N/A"},{"$f":"VLOOKUP(A166,出库表!B:H,5,0)","v":{"$error":"#N/A"}},{"$f":"VLOOKUP(A166,出库表!B:H,7,0)","v":{"$error":"#N/A"}},{"$error":"#N/A"},{"$error":"#N/A"},{"$error":"#N/A"}]
[null,{"$f":"VLOOKUP(A167,商品信息!A:E,2,0)","v":{"$error":"#N/A"}},{"$f":"VLOOKUP(A167,商品信息!A:E,3,0)","v":{"$error":"#N/A"}},null,null,{"$f":"VLOOKUP(A167,入库表!B:H,5,0)","v":{"$error":"#N/A"}},{"$f":"VLOOKUP(A167,入库表!B:H,7,0)","v":{"$error":"#N/A"}},{"$error":"#N/A"},{"$f":"VLOOKUP(A167,出库表!B:H,5,0)","v":{"$error":"#N/A"}},{"$f":"VLOOKUP(A167,出库表!B:H,7,0)","v":{"$error":"#N/A"}},{"$error":"#N/A"},{"$error":"#N/A"},{"$error":"#N/A"}]
[null,{"$f":"VLOOKUP(A168,商品信息!A:E,2,0)","v":{"$error":"#N/A"}},{"$f":"VLOOKUP(A168,商品信息!A:E,3,0)","v":{"$error":"#N/A"}},null,null,{"$f":"VLOOKUP(A168,入库表!B:H,5,0)","v":{"$error":"#N/A"}},{"$f":"VLOOKUP(A168,入库表!B:H,7,0)","v":{"$error":"#N/A"}},{"$error":"#N/A"},{"$f":"VLOOKUP(A168,出库表!B:H,5,0)","v":{"$error":"#N/A"}},{"$f":"VLOOKUP(A168,出库表!B:H,7,0)","v":{"$error":"#N/A"}},{"$error":"#N/A"},{"$error":"#N/A"},{"$error":"#N/A"}]
[null,{"$f":"VLOOKUP(A169,商品信息!A:E,2,0)","v":{"$error":"#N/A"}},{"$f":"VLOOKUP(A169,商品信息!A:E,3,0)","v":{"$error":"#N/A"}},null,null,{"$f":"VLOOKUP(A169,入库表!B:H,5,0)","v":{"$error":"#N/A"}},{"$f":"VLOOKUP(A169,入库表!B:H,7,0)","v":{"$error":"#N/A"}},{"$error":"#N/A"},{"$f":"VLOOKUP(A169,出库表!B:H,5,0)","v":{"$error":"#N/A"}},{"$f":"VLOOKUP(A169,出库表!B:H,7,0)","v":{"$error":"#N/A"}},{"$error":"#N/A"},{"$error":"#N/A"},{"$error":"#N/A"}]
[null,{"$f":"VLOOKUP(A170,商品信息!A:E,2,0)","v":{"$error":"#N/A"}},{"$f":"VLOOKUP(A170,商品信息!A:E,3,0)","v":{"$error":"#N/A"}},null,null,{"$f":"VLOOKUP(A170,入库表!B:H,5,0)","v":{"$error":"#N/A"}},{"$f":"VLOOKUP(A170,入库表!B:H,7,0)","v":{"$error":"#N/A"}},{"$error":"#N/A"},{"$f":"VLOOKUP(A170,出库表!B:H,5,0)","v":{"$error":"#N/A"}},{"$f":"VLOOKUP(A170,出库表!B:H,7,0)","v":{"$error":"#N/A"}},{"$error":"#N/A"},{"$error":"#N/A"},{"$error":"#N/A"}]
[null,{"$f":"VLOOKUP(A171,商品信息!A:E,2,0)","v":{"$error":"#N/A"}},{"$f":"VLOOKUP(A171,商品信息!A:E,3,0)","v":{"$error":"#N/A"}},null,null,{"$f":"VLOOKUP(A171,入库表!B:H,5,0)","v":{"$error":"#N/A"}},{"$f":"VLOOKUP(A171,入库表!B:H,7,0)","v":{"$error":"#N/A"}},{"$error":"#N/A"},{"$f":"VLOOKUP(A171,出库表!B:H,5,0)","v":{"$error":"#N/A"}},{"$f":"VLOOKUP(A171,出库表!B:H,7,0)","v":{"$error":"#N/A"}},{"$error":"#N/A"},{"$error":"#N/A"},{"$error":"#N/A"}]
[null,{"$f":"VLOOKUP(A172,商品信息!A:E,2,0)","v":{"$error":"#N/A"}},{"$f":"VLOOKUP(A172,商品信息!A:E,3,0)","v":{"$error":"#N/A"}},null,null,{"$f":"VLOOKUP(A172,入库表!B:H,5,0)","v":{"$error":"#N/A"}},{"$f":"VLOOKUP(A172,入库表!B:H,7,0)","v":{"$error":"#N/A"}},{"$error":"#N/A"},{"$f":"VLOOKUP(A172,出库表!B:H,5,0)","v":{"$error":"#N/A"}},{"$f":"VLOOKUP(A172,出库表!B:H,7,0)","v":{"$error":"#N/A"}},{"$error":"#N/A"},{"$error":"#N/A"},{"$error":"#N/A"}]
[null,{"$f":"VLOOKUP(A173,商品信息!A:E,2,0)","v":{"$error":"#N/A"}},{"$f":"VLOOKUP(A173,商品信息!A:E,3,0)","v":{"$error":"#N/A"}},null,null,{"$f":"VLOOKUP(A173,入库表!B:H,5,0)","v":{"$error":"#N/A"}},{"$f":"VLOOKUP(A173,入库表!B:H,7,0)","v":{"$error":"#N/A"}},{"$error":"#N/A"},{"$f":"VLOOKUP(A173,出库表!B:H,5,0)","v":{"$error":"#N/A"}},{"$f":"VLOOKUP(A173,出库表!B:H,7,0)","v":{"$error":"#N/A"}},{"$error":"#N/A"},{"$error":"#N/A"},{"$error":"#N/A"}]
[null,{"$f":"VLOOKUP(A174,商品信息!A:E,2,0)","v":{"$error":"#N/A"}},{"$f":"VLOOKUP(A174,商品信息!A:E,3,0)","v":{"$error":"#N/A"}},null,null,{"$f":"VLOOKUP(A174,入库表!B:H,5,0)","v":{"$error":"#N/A"}},{"$f":"VLOOKUP(A174,入库表!B:H,7,0)","v":{"$error":"#N/A"}},{"$error":"#N/A"},{"$f":"VLOOKUP(A174,出库表!B:H,5,0)","v":{"$error":"#N/A"}},{"$f":"VLOOKUP(A174,出库表!B:H,7,0)","v":{"$error":"#N/A"}},{"$error":"#N/A"},{"$error":"#N/A"},{"$error":"#N/A"}]
[null,{"$f":"VLOOKUP(A175,商品信息!A:E,2,0)","v":{"$error":"#N/A"}},{"$f":"VLOOKUP(A175,商品信息!A:E,3,0)","v":{"$error":"#N/A"}},null,null,{"$f":"VLOOKUP(A175,入库表!B:H,5,0)","v":{"$error":"#N/A"}},{"$f":"VLOOKUP(A175,入库表!B:H,7,0)","v":{"$error":"#N/A"}},{"$error":"#N/A"},{"$f":"VLOOKUP(A175,出库表!B:H,5,0)","v":{"$error":"#N/A"}},{"$f":"VLOOKUP(A175,出库表!B:H,7,0)","v":{"$error":"#N/A"}},{"$error":"#N/A"},{"$error":"#N/A"},{"$error":"#N/A"}]
[null,{"$f":"VLOOKUP(A176,商品信息!A:E,2,0)","v":{"$error":"#N/A"}},{"$f":"VLOOKUP(A176,商品信息!A:E,3,0)","v":{"$error":"#N/A"}},null,null,{"$f":"VLOOKUP(A176,入库表!B:H,5,0)","v":{"$error":"#N/A"}},{"$f":"VLOOKUP(A176,入库表!B:H,7,0)","v":{"$error":"#N/A"}},{"$error":"#N/A"},{"$f":"VLOOKUP(A176,出库表!B:H,5,0)","v":{"$error":"#N/A"}},{"$f":"VLOOKUP(A176,出库表!B:H,7,0)","v":{"$error":"#N/A"}},{"$error":"#N/A"},{"$error":"#N/A"},{"$error":"#N/A"}]
[null,{"$f":"VLOOKUP(A177,商品信息!A:E,2,0)","v":{"$error":"#N/A"}},{"$f":"VLOOKUP(A177,商品信息!A:E,3,0)","v":{"$error":"#N/A"}},null,null,{"$f":"VLOOKUP(A177,入库表!B:H,5,0)","v":{"$error":"#N/A"}},{"$f":"VLOOKUP(A177,入库表!B:H,7,0)","v":{"$error":"#N/A"}},{"$error":"#N/A"},{"$f":"VLOOKUP(A177,出库表!B:H,5,0)","v":{"$error":"#N/A"}},{"$f":"VLOOKUP(A177,出库表!B:H,7,0)","v":{"$error":"#N/A"}},{"$error":"#N/A"},{"$error":"#N/A"},{"$error":"#N/A"}]
[null,{"$f":"VLOOKUP(A178,商品信息!A:E,2,0)","v":{"$error":"#N/A"}},{"$f":"VLOOKUP(A178,商品信息!A:E,3,0)","v":{"$error":"#N/A"}},null,null,{"$f":"VLOOKUP(A178,入库表!B:H,5,0)","v":{"$error":"#N/A"}},{"$f":"VLOOKUP(A178,入库表!B:H,7,0)","v":{"$error":"#N/A"}},{"$error":"#N/A"},{"$f":"VLOOKUP(A178,出库表!B:H,5,0)","v":{"$error":"#N/A"}},{"$f":"VLOOKUP(A178,出库表!B:H,7,0)","v":{"$error":"#N/A"}},{"$error":"#N/A"},{"$error":"#N/A"},{"$error":"#N/A"}]
[null,{"$f":"VLOOKUP(A179,商品信息!A:E,2,0)","v":{"$error":"#N/A"}},{"$f":"VLOOKUP(A179,商品信息!A:E,3,0)","v":{"$error":"#N/A"}},null,null,{"$f":"VLOOKUP(A179,入库表!B:H,5,0)","v":{"$error":"#N/A"}},{"$f":"VLOOKUP(A179,入库表!B:H,7,0)","v":{"$error":"#N/A"}},{"$error":"#N/A"},{"$f":"VLOOKUP(A179,出库表!B:H,5,0)","v":{"$error":"#N/A"}},{"$f":"VLOOKUP(A179,出库表!B:H,7,0)","v":{"$error":"#N/A"}},{"$error":"#N/A"},{"$error":"#N/A"},{"$error":"#N/A"}]
[null,{"$f":"VLOOKUP(A180,商品信息!A:E,2,0)","v":{"$error":"#N/A"}},{"$f":"VLOOKUP(A180,商品信息!A:E,3,0)","v":{"$error":"#N/A"}},null,null,{"$f":"VLOOKUP(A180,入库表!B:H,5,0)","v":{"$error":"#N/A"}},{"$f":"VLOOKUP(A180,入库表!B:H,7,0)","v":{"$error":"#N/A"}},{"$error":"#N/A"},{"$f":"VLOOKUP(A180,出库表!B:H,5,0)","v":{"$error":"#N/A"}},{"$f":"VLOOKUP(A180,出库表!B:H,7,0)","v":{"$error":"#N/A"}},{"$error":"#N/A"},{"$error":"#N/A"},{"$error":"#N/A"}]
[null,{"$f":"VLOOKUP(A181,商品信息!A:E,2,0)","v":{"$error":"#N/A"}},{"$f":"VLOOKUP(A181,商品信息!A:E,3,0)","v":{"$error":"#N/A"}},null,null,{"$f":"VLOOKUP(A181,入库表!B:H,5,0)","v":{"$error":"#N/A"}},{"$f":"VLOOKUP(A181,入库表!B:H,7,0)","v":{"$error":"#N/A"}},{"$error":"#N/A"},{"$f":"VLOOKUP(A181,出库表!B:H,5,0)","v":{"$error":"#N/A"}},{"$f":"VLOOKUP(A181,出库表!B:H,7,0)","v":{"$error":"#N/A"}},{"$error":"#N/A"},{"$error":"#N/A"},{"$error":"#N/A"}]
[null,{"$f":"VLOOKUP(A182,商品信息!A:E,2,0)","v":{"$error":"#N/A"}},{"$f":"VLOOKUP(A182,商品信息!A:E,3,0)","v":{"$error":"#N/A"}},null,null,{"$f":"VLOOKUP(A182,入库表!B:H,5,0)","v":{"$error":"#N/A"}},{"$f":"VLOOKUP(A182,入库表!B:H,7,0)","v":{"$error":"#N/A"}},{"$error":"#N/A"},{"$f":"VLOOKUP(A182,出库表!B:H,5,0)","v":{"$error":"#N/A"}},{"$f":"VLOOKUP(A182,出库表!B:H,7,0)","v":{"$error":"#N/A"}},{"$error":"#N/A"},{"$error":"#N/A"},{"$error":"#N/A"}]
[null,{"$f":"VLOOKUP(A183,商品信息!A:E,2,0)","v":{"$error":"#N/A"}},{"$f":"VLOOKUP(A183,商品信息!A:E,3,0)","v":{"$error":"#N/A"}},null,null,{"$f":"VLOOKUP(A183,入库表!B:H,5,0)","v":{"$error":"#N/A"}},{"$f":"VLOOKUP(A183,入库表!B:H,7,0)","v":{"$error":"#N/A"}},{"$error":"#N/A"},{"$f":"VLOOKUP(A183,出库表!B:H,5,0)","v":{"$error":"#N/A"}},{"$f":"VLOOKUP(A183,出库表!B:H,7,0)","v":{"$error":"#N/A"}},{"$error":"#N/A"},{"$error":"#N/A"},{"$error":"#N/A"}]
[null,{"$f":"VLOOKUP(A184,商品信息!A:E,2,0)","v":{"$error":"#N/A"}},{"$f":"VLOOKUP(A184,商品信息!A:E,3,0)","v":{"$error":"#N/A"}},null,null,{"$f":"VLOOKUP(A184,入库表!B:H,5,0)","v":{"$error":"#N/A"}},{"$f":"VLOOKUP(A184,入库表!B:H,7,0)","v":{"$error":"#N/A"}},{"$error":"#N/A"},{"$f":"VLOOKUP(A184,出库表!B:H,5,0)","v":{"$error":"#N/A"}},{"$f":"VLOOKUP(A184,出库表!B:H,7,0)","v":{"$error":"#N/A"}},{"$error":"#N/A"},{"$error":"#N/A"},{"$error":"#N/A"}]
[null,{"$f":"VLOOKUP(A185,商品信息!A:E,2,0)","v":{"$error":"#N/A"}},{"$f":"VLOOKUP(A185,商品信息!A:E,3,0)","v":{"$error":"#N/A"}},null,null,{"$f":"VLOOKUP(A185,入库表!B:H,5,0)","v":{"$error":"#N/A"}},{"$f":"VLOOKUP(A185,入库表!B:H,7,0)","v":{"$error":"#N/A"}},{"$error":"#N/A"},{"$f":"VLOOKUP(A185,出库表!B:H,5,0)","v":{"$error":"#N/A"}},{"$f":"VLOOKUP(A185,出库表!B:H,7,0)","v":{"$error":"#N/A"}},{"$error":"#N/A"},{"$error":"#N/A"},{"$error":"#N/A"}]
[null,{"$f":"VLOOKUP(A186,商品信息!A:E,2,0)","v":{"$error":"#N/A"}},{"$f":"VLOOKUP(A186,商品信息!A:E,3,0)","v":{"$error":"#N/A"}},null,null,{"$f":"VLOOKUP(A186,入库表!B:H,5,0)","v":{"$error":"#N/A"}},{"$f":"VLOOKUP(A186,入库表!B:H,7,0)","v":{"$error":"#N/A"}},{"$error":"#N/A"},{"$f":"VLOOKUP(A186,出库表!B:H,5,0)","v":{"$error":"#N/A"}},{"$f":"VLOOKUP(A186,出库表!B:H,7,0)","v":{"$error":"#N/A"}},{"$error":"#N/A"},{"$error":"#N/A"},{"$error":"#N/A"}]
[null,{"$f":"VLOOKUP(A187,商品信息!A:E,2,0)","v":{"$error":"#N/A"}},{"$f":"VLOOKUP(A187,商品信息!A:E,3,0)","v":{"$error":"#N/A"}},null,null,{"$f":"VLOOKUP(A187,入库表!B:H,5,0)","v":{"$error":"#N/A"}},{"$f":"VLOOKUP(A187,入库表!B:H,7,0)","v":{"$error":"#N/A"}},{"$error":"#N/A"},{"$f":"VLOOKUP(A187,出库表!B:H,5,0)","v":{"$error":"#N/A"}},{"$f":"VLOOKUP(A187,出库表!B:H,7,0)","v":{"$error":"#N/A"}},{"$error":"#N/A"},{"$error":"#N/A"},{"$error":"#N/A"}]
[null,{"$f":"VLOOKUP(A188,商品信息!A:E,2,0)","v":{"$error":"#N/A"}},{"$f":"VLOOKUP(A188,商品信息!A:E,3,0)","v":{"$error":"#N/A"}},null,null,{"$f":"VLOOKUP(A188,入库表!B:H,5,0)","v":{"$error":"#N/A"}},{"$f":"VLOOKUP(A188,入库表!B:H,7,0)","v":{"$error":"#N/A"}},{"$error":"#N/A"},{"$f":"VLOOKUP(A188,出库表!B:H,5,0)","v":{"$error":"#N/A"}},{"$f":"VLOOKUP(A188,出库表!B:H,7,0)","v":{"$error":"#N/A"}},{"$error":"#N/A"},{"$error":"#N/A"},{"$error":"#N/A"}]
[null,{"$f":"VLOOKUP(A189,商品信息!A:E,2,0)","v":{"$error":"#N/A"}},{"$f":"VLOOKUP(A189,商品信息!A:E,3,0)","v":{"$error":"#N/A"}},null,null,{"$f":"VLOOKUP(A189,入库表!B:H,5,0)","v":{"$error":"#N/A"}},{"$f":"VLOOKUP(A189,入库表!B:H,7,0)","v":{"$error":"#N/A"}},{"$error":"#N/A"},{"$f":"VLOOKUP(A189,出库表!B:H,5,0)","v":{"$error":"#N/A"}},{"$f":"VLOOKUP(A189,出库表!B:H,7,0)","v":{"$error":"#N/A"}},{"$error":"#N/A"},{"$error":"#N/A"},{"$error":"#N/A"}]
[null,{"$f":"VLOOKUP(A190,商品信息!A:E,2,0)","v":{"$error":"#N/A"}},{"$f":"VLOOKUP(A190,商品信息!A:E,3,0)","v":{"$error":"#N/A"}},null,null,{"$f":"VLOOKUP(A190,入库表!B:H,5,0)","v":{"$error":"#N/A"}},{"$f":"VLOOKUP(A190,入库表!B:H,7,0)","v":{"$error":"#N/A"}},{"$error":"#N/A"},{"$f":"VLOOKUP(A190,出库表!B:H,5,0)","v":{"$error":"#N/A"}},{"$f":"VLOOKUP(A190,出库表!B:H,7,0)","v":{"$error":"#N/A"}},{"$error":"#N/A"},{"$error":"#N/A"},{"$error":"#N/A"}]
[null,{"$f":"VLOOKUP(A191,商品信息!A:E,2,0)","v":{"$error":"#N/A"}},{"$f":"VLOOKUP(A191,商品信息!A:E,3,0)","v":{"$error":"#N/A"}},null,null,{"$f":"VLOOKUP(A191,入库表!B:H,5,0)","v":{"$error":"#N/A"}},{"$f":"VLOOKUP(A191,入库表!B:H,7,0)","v":{"$error":"#N/A"}},{"$error":"#N/A"},{"$f":"VLOOKUP(A191,出库表!B:H,5,0)","v":{"$error":"#N/A"}},{"$f":"VLOOKUP(A191,出库表!B:H,7,0)","v":{"$error":"#N/A"}},{"$error":"#N/A"},{"$error":"#N/A"},{"$error":"#N/A"}]
[null,{"$f":"VLOOKUP(A192,商品信息!A:E,2,0)","v":{"$error":"#N/A"}},{"$f":"VLOOKUP(A192,商品信息!A:E,3,0)","v":{"$error":"#N/A"}},null,null,{"$f":"VLOOKUP(A192,入库表!B:H,5,0)","v":{"$error":"#N/A"}},{"$f":"VLOOKUP(A192,入库表!B:H,7,0)","v":{"$error":"#N/A"}},{"$error":"#N/A"},{"$f":"VLOOKUP(A192,出库表!B:H,5,0)","v":{"$error":"#N/A"}},{"$f":"VLOOKUP(A192,出库表!B:H,7,0)","v":{"$error":"#N/A"}},{"$error":"#N/A"},{"$error":"#N/A"},{"$error":"#N/A"}]
[null,{"$f":"VLOOKUP(A193,商品信息!A:E,2,0)","v":{"$error":"#N/A"}},{"$f":"VLOOKUP(A193,商品信息!A:E,3,0)","v":{"$error":"#N/A"}},null,null,{"$f":"VLOOKUP(A193,入库表!B:H,5,0)","v":{"$error":"#N/A"}},{"$f":"VLOOKUP(A193,入库表!B:H,7,0)","v":{"$error":"#N/A"}},{"$error":"#N/A"},{"$f":"VLOOKUP(A193,出库表!B:H,5,0)","v":{"$error":"#N/A"}},{"$f":"VLOOKUP(A193,出库表!B:H,7,0)","v":{"$error":"#N/A"}},{"$error":"#N/A"},{"$error":"#N/A"},{"$error":"#N/A"}]
[null,{"$f":"VLOOKUP(A194,商品信息!A:E,2,0)","v":{"$error":"#N/A"}},{"$f":"VLOOKUP(A194,商品信息!A:E,3,0)","v":{"$error":"#N/A"}},null,null,{"$f":"VLOOKUP(A194,入库表!B:H,5,0)","v":{"$error":"#N/A"}},{"$f":"VLOOKUP(A194,入库表!B:H,7,0)","v":{"$error":"#N/A"}},{"$error":"#N/A"},{"$f":"VLOOKUP(A194,出库表!B:H,5,0)","v":{"$error":"#N/A"}},{"$f":"VLOOKUP(A194,出库表!B:H,7,0)","v":{"$error":"#N/A"}},{"$error":"#N/A"},{"$error":"#N/A"},{"$error":"#N/A"}]
[null,{"$f":"VLOOKUP(A195,商品信息!A:E,2,0)","v":{"$error":"#N/A"}},{"$f":"VLOOKUP(A195,商品信息!A:E,3,0)","v":{"$error":"#N/A"}},null,null,{"$f":"VLOOKUP(A195,入库表!B:H,5,0)","v":{"$error":"#N/A"}},{"$f":"VLOOKUP(A195,入库表!B:H,7,0)","v":{"$error":"#N/A"}},{"$f":"F195*G195","v":{"$error":"#N/A"}},{"$f":"VLOOKUP(A195,出库表!B:H,5,0)","v":{"$error":"#N/A"}},{"$f":"VLOOKUP(A195,出库表!B:H,7,0)","v":{"$error":"#N/A"}},{"$error":"#N/A"},{"$error":"#N/A"},{"$error":"#N/A"}]
[null,{"$f":"VLOOKUP(A196,商品信息!A:E,2,0)","v":{"$error":"#N/A"}},{"$f":"VLOOKUP(A196,商品信息!A:E,3,0)","v":{"$error":"#N/A"}},null,null,{"$f":"VLOOKUP(A196,入库表!B:H,5,0)","v":{"$error":"#N/A"}},{"$f":"VLOOKUP(A196,入库表!B:H,7,0)","v":{"$error":"#N/A"}},{"$error":"#N/A"},{"$f":"VLOOKUP(A196,出库表!B:H,5,0)","v":{"$error":"#N/A"}},{"$f":"VLOOKUP(A196,出库表!B:H,7,0)","v":{"$error":"#N/A"}},{"$f":"I196*J196","v":{"$error":"#N/A"}},{"$f":"F196-I196","v":{"$error":"#N/A"}},{"$f":"I196*(J196-G196)","v":{"$error":"#N/A"}}]
[null,{"$f":"VLOOKUP(A197,商品信息!A:E,2,0)","v":{"$error":"#N/A"}},{"$f":"VLOOKUP(A197,商品信息!A:E,3,0)","v":{"$error":"#N/A"}},null,null,{"$f":"VLOOKUP(A197,入库表!B:H,5,0)","v":{"$error":"#N/A"}},{"$f":"VLOOKUP(A197,入库表!B:H,7,0)","v":{"$error":"#N/A"}},{"$error":"#N/A"},{"$f":"VLOOKUP(A197,出库表!B:H,5,0)","v":{"$error":"#N/A"}},{"$f":"VLOOKUP(A197,出库表!B:H,7,0)","v":{"$error":"#N/A"}},{"$error":"#N/A"},{"$error":"#N/A"},{"$error":"#N/A"}]
[null,{"$f":"VLOOKUP(A198,商品信息!A:E,2,0)","v":{"$error":"#N/A"}},{"$f":"VLOOKUP(A198,商品信息!A:E,3,0)","v":{"$error":"#N/A"}},null,null,{"$f":"VLOOKUP(A198,入库表!B:H,5,0)","v":{"$error":"#N/A"}},{"$f":"VLOOKUP(A198,入库表!B:H,7,0)","v":{"$error":"#N/A"}},{"$error":"#N/A"},{"$f":"VLOOKUP(A198,出库表!B:H,5,0)","v":{"$error":"#N/A"}},{"$f":"VLOOKUP(A198,出库表!B:H,7,0)","v":{"$error":"#N/A"}},{"$error":"#N/A"},{"$error":"#N/A"},{"$error":"#N/A"}]
[null,{"$f":"VLOOKUP(A199,商品信息!A:E,2,0)","v":{"$error":"#N/A"}},{"$f":"VLOOKUP(A199,商品信息!A:E,3,0)","v":{"$error":"#N/A"}},null,null,{"$f":"VLOOKUP(A199,入库表!B:H,5,0)","v":{"$error":"#N/A"}},{"$f":"VLOOKUP(A199,入库表!B:H,7,0)","v":{"$error":"#N/A"}},{"$error":"#N/A"},{"$f":"VLOOKUP(A199,出库表!B:H,5,0)","v":{"$error":"#N/A"}},{"$f":"VLOOKUP(A199,出库表!B:H,7,0)","v":{"$error":"#N/A"}},{"$error":"#N/A"},{"$error":"#N/A"},{"$error":"#N/A"}]
[null,{"$f":"VLOOKUP(A200,商品信息!A:E,2,0)","v":{"$error":"#N/A"}},{"$f":"VLOOKUP(A200,商品信息!A:E,3,0)","v":{"$error":"#N/A"}},null,null,{"$f":"VLOOKUP(A200,入库表!B:H,5,0)","v":{"$error":"#N/A"}},{"$f":"VLOOKUP(A200,入库表!B:H,7,0)","v":{"$error":"#N/A"}},{"$error":"#N/A"},{"$f":"VLOOKUP(A200,出库表!B:H,5,0)","v":{"$error":"#N/A"}},{"$f":"VLOOKUP(A200,出库表!B:H,7,0)","v":{"$error":"#N/A"}},{"$error":"#N/A"},{"$error":"#N/A"},{"$error":"#N/A"}]

{"sheet":"出入库单据","index":7,"n_rows":14,"n_cols":17,"rows_kept":14,"cut":false,"hidden":false,"merged":[[0,9,0,16],[1,10,1,14],[12,10,12,14],[13,10,13,12],[13,13,13,14],[13,15,13,16],[0,0,0,7],[1,1,1,5],[12,1,12,5],[13,1,13,3],[13,4,13,5],[13,6,13,7]]}
["入库单",null,null,null,null,null,null,null,null,"出库单"]
["供应商",null,null,null,null,null,"入库日期",null,null,"客户名称",null,null,null,null,null,"送货日期"]
["序号","货品名称","规格型号","单位","数量","单价","金额","备注",null,"序号","货品名称","规格型号","单位","数量","单价","金额","备注"]
[null,"HPMC-001","GGXH-001","件",10,1625,{"$f":"E4*F4","v":16250},null,null,null,"HPMC-001","GGXH-001","件",65,25,{"$f":"O4*N4","v":1625}]
[null,"HPMC-002","GGXH-002","件",100,7104,{"$f":"E5*F5","v":710400},null,null,null,"HPMC-002","GGXH-002","件",192,37,{"$f":"O5*N5","v":7104}]
[null,"HPMC-003","GGXH-003","件",599,4860,2911140,null,null,null,"HPMC-003","GGXH-003","件",108,45,4860]
[null,"HPMC-004","GGXH-004","件",385,1110,427350,null,null,null,"HPMC-004","GGXH-004","件",37,30,1110]
[null,"HPMC-005","GGXH-005","件",59,6683,394297,null,null,null,"HPMC-005","GGXH-005","件",163,41,6683]
[null,"HPMC-006","GGXH-006","件",99,15635,1547865,null,null,null,"HPMC-006","GGXH-006","件",295,53,15635]
[null,"HPMC-007","GGXH-007","件",80,5310,424800,null,null,null,"HPMC-007","GGXH-007","件",118,45,5310]
[null,null,{"$error":"#N/A"},{"$error":"#N/A"}]
[null,null,{"$error":"#N/A"},{"$error":"#N/A"}]
["总计金额大写：",{"$f":"H13","v":6432102},null,null,null,null,"合计：",{"$f":"SUM(G4:G12)","v":6432102},null,"总计金额大写：",{"$f":"Q13","v":42327},null,null,null,null,"合计：",{"$f":"SUM(P4:P12)","v":42327}]
["审核：",null,null,null,"签收：",null,null,null,null,"审核：",null,null,null,"收货单位签收："]

{"sheet":"出入库存查询","index":8,"n_rows":0,"n_cols":0,"rows_kept":0,"cut":false,"hidden":false,"merged":[]}

{"sheet":"应收明细","index":9,"n_rows":9,"n_cols":11,"rows_kept":9,"cut":false,"hidden":false,"merged":[[0,0,0,10]]}
[]
["销售日期","货品编码","货品名称","规格型号","颜    色","数    量","单    位","销售单价","金    额","实收金额","欠收款金额"]
["2018-02-20","BM001",{"$f":"VLOOKUP(B3,商品信息!A:E,2,0)","v":"HPMC-001"},{"$f":"VLOOKUP(B3,商品信息!A:E,3,0)","v":"GGXH-001"},"红色",65,"件",25,{"$f":"H3*F3","v":1625},100,{"$f":"I3-J3","v":1525}]
["2018-02-21","BM002",{"$f":"VLOOKUP(B4,商品信息!A:E,2,0)","v":"HPMC-002"},{"$f":"VLOOKUP(B4,商品信息!A:E,3,0)","v":"GGXH-002"},"蓝色",192,"件",37,{"$f":"H4*F4","v":7104},100,{"$f":"I4-J4","v":7004}]
["2018-02-22","BM003",{"$f":"VLOOKUP(B5,商品信息!A:E,2,0)","v":"HPMC-003"},{"$f":"VLOOKUP(B5,商品信息!A:E,3,0)","v":"GGXH-003"},"黑色",108,"件",45,4860,100,4760]
["2018-02-23","BM004",{"$f":"VLOOKUP(B6,商品信息!A:E,2,0)","v":"HPMC-004"},{"$f":"VLOOKUP(B6,商品信息!A:E,3,0)","v":"GGXH-004"},"黄色",37,"件",30,1110,100,1010]
["2018-02-24","BM005",{"$f":"VLOOKUP(B7,商品信息!A:E,2,0)","v":"HPMC-005"},{"$f":"VLOOKUP(B7,商品信息!A:E,3,0)","v":"GGXH-005"},"紫色",163,"件",41,6683,100,6583]
["2018-02-25","BM006",{"$f":"VLOOKUP(B8,商品信息!A:E,2,0)","v":"HPMC-006"},{"$f":"VLOOKUP(B8,商品信息!A:E,3,0)","v":"GGXH-006"},"金色",295,"件",53,15635,10000,5635]
["2018-02-26","BM007",{"$f":"VLOOKUP(B9,商品信息!A:E,2,0)","v":"HPMC-007"},{"$f":"VLOOKUP(B9,商品信息!A:E,3,0)","v":"GGXH-007"},"橙色",118,"件",45,5310,1000,4310]

{"sheet":"应付明细","index":10,"n_rows":9,"n_cols":11,"rows_kept":9,"cut":false,"hidden":false,"merged":[[0,0,0,10]]}
[]
["采购日期","货品编码","货品名称","规格型号","颜    色","数    量","单    位","进货单价","金    额","实付金额","欠款金额"]
["2018-02-08","BM001",{"$f":"VLOOKUP(B3,商品信息!A:E,2,0)","v":"HPMC-001"},{"$f":"VLOOKUP(B3,商品信息!A:E,3,0)","v":"GGXH-001"},"红色",192,"件",16,{"$f":"F3*H3","v":3072},1500,{"$f":"I3-J3","v":1572}]
["2018-02-09","BM002",{"$f":"VLOOKUP(B4,商品信息!A:E,2,0)","v":"HPMC-002"},{"$f":"VLOOKUP(B4,商品信息!A:E,3,0)","v":"GGXH-002"},"蓝色",265,"件",25,{"$f":"F4*H4","v":6625},1500,{"$f":"I4-J4","v":5125}]
["2018-02-10","BM003",{"$f":"VLOOKUP(B5,商品信息!A:E,2,0)","v":"HPMC-003"},{"$f":"VLOOKUP(B5,商品信息!A:E,3,0)","v":"GGXH-003"},"黑色",165,"件",36,5940,1500,4440]
["2018-02-11","BM004",{"$f":"VLOOKUP(B6,商品信息!A:E,2,0)","v":"HPMC-004"},{"$f":"VLOOKUP(B6,商品信息!A:E,3,0)","v":"GGXH-004"},"黄色",98,"件",19,1862,1500,362]
["2018-02-12","BM005",{"$f":"VLOOKUP(B7,商品信息!A:E,2,0)","v":"HPMC-005"},{"$f":"VLOOKUP(B7,商品信息!A:E,3,0)","v":"GGXH-005"},"紫色",209,"件",29,6061,1500,4561]
["2018-02-13","BM006",{"$f":"VLOOKUP(B8,商品信息!A:E,2,0)","v":"HPMC-006"},{"$f":"VLOOKUP(B8,商品信息!A:E,3,0)","v":"GGXH-006"},"红色",350,"件",25,8750,1500,7250]
["2018-02-14","BM007",{"$f":"VLOOKUP(B9,商品信息!A:E,2,0)","v":"HPMC-007"},{"$f":"VLOOKUP(B9,商品信息!A:E,3,0)","v":"GGXH-007"},"橙色",189,"件",30,5670,1500,4170]

{"sheet":"数据统计","index":11,"n_rows":0,"n_cols":0,"rows_kept":0,"cut":false,"hidden":false,"merged":[]}

{"sheet":"单据库","index":12,"n_rows":1,"n_cols":1,"rows_kept":1,"cut":false,"hidden":false,"merged":[[0,0,0,16],[27,1,27,3],[27,4,27,5],[27,6,27,7],[14,1,14,5],[25,1,25,5],[26,1,26,3],[26,4,26,5],[26,6,26,7],[1,1,1,5],[12,1,12,5],[13,1,13,3],[13,4,13,5],[13,6,13,7]]}
[" 出入库单据"]

{"sheet":"使用说明","index":13,"n_rows":2,"n_cols":1,"rows_kept":2,"cut":false,"hidden":false,"merged":[]}
["使用说明"]
["1.本表由VBA编码制作而成，用户使用本模板时需启动宏，工作簿中带有公式的单元格都已保护，如需更改可以到审阅-取消工作表保护即可，在更改工作表之前请做好备份工作，本工作簿需要用户将基础信息录入进来，为后面的工作表提供基础数据。\n2.出入库表中都带有公式，填写数据后会自动进行计算,填入数据可以双击任意单元格会弹出窗口，在窗口中输入。\n3.库存查询工作表中需要用户进行选择入库、出库或者库存，选完后系统会根据用户填写的日期和商品编码进行查询。\n4.应收应付工作表中只需要点击按钮系统会自动分析出应收应付的明细并且呈现出来。\n5.单击保存单据按钮系统会自动保存出入库的单据。\n6.利润统计表会跟前面的数据自动呈现。"]