{"text_format":"1","workbook":"xlsx","n_sheets":14,"sheets":["菜单","商品信息","供应商信息","客户信息","入库表","出库表","库存表","出入库单据","出入库存查询","应收明细","应付明细","数据统计","单据库","使用说明"],"not_rendered":{"charts":3,"images":4,"macros":1,"external_links":0,"defined_names":3,"comments":0,"pivot_tables":0},"unopened":[],"bounds":{"document_bytes":16777216,"sheet_cells":100000,"rows_first":2000,"rows_last":500,"rows_between":2000,"halvings":0,"cell_chars":16384,"cell_head_chars":4096},"cells_cut":0,"cells_raw":0,"read":"whole","date_system":"1900"}

{"sheet":"菜单","index":0,"n_rows":0,"n_cols":0,"rows_kept":0,"cut":false,"hidden":false,"merged":[[0,0,1,10],[13,0,14,10]]}

{"sheet":"商品信息","index":1,"n_rows":9,"n_cols":6,"rows_kept":9,"cut":false,"hidden":false,"merged":[[0,0,0,5]]}
["商品信息"]
["货品编码","货品名称","规格型号","单位","进货单价","供应商"]
["BM001","HPMC-001","GGXH-001","件",16,"深圳鸿达科技有限公司"]
["BM002","HPMC-002","GGXH-002","件",25,"广州鸿达科技有限公司"]
["BM003","HPMC-003","GGXH-003","件",36,"上海鸿达科技有限公司"]
["BM004","HPMC-004","GGXH-004","件",19,"北京鸿达科技有限公司"]
["BM005","HPMC-005","GGXH-005","件",29,"厦门鸿达科技有限公司"]
["BM006","HPMC-006","GGXH-006","件",37,"珠海鸿达科技有限公司"]
["BM007","HPMC-007","GGXH-007","件",30,"佛山鸿达科技有限公司"]

{"sheet":"供应商信息","index":2,"n_rows":9,"n_cols":9,"rows_kept":9,"cut":false,"hidden":false,"merged":[[0,0,0,8]]}
["供应商信息"]
["货品编码","货品名称","规格型号","单位","进货单价","供应商","供应商联系人","联系人电话","地址"]
["BM001","HPMC-001","GGXH-001","个",16,"深圳鸿达科技有限公司","张三",1001008611,"深圳"]
["BM002","HPMC-002","GGXH-002","个",25,"广州鸿达科技有限公司","李四",1001008612,"广州"]
["BM003","HPMC-003","GGXH-003","个",36,"上海鸿达科技有限公司","王五",1001008613,"上海"]
["BM004","HPMC-004","GGXH-004","个",19,"北京鸿达科技有限公司","赵六",1001008614,"北京"]
["BM005","HPMC-005","GGXH-005","个",29,"厦门鸿达科技有限公司","洪七",1001008615,"厦门"]
["BM006","HPMC-006","GGXH-006","个",37,"珠海鸿达科技有限公司","万八",1001008616,"珠海"]
["BM007","HPMC-007","GGXH-007","个",30,"佛山鸿达科技有限公司","汪九",1001008617,"佛山"]

{"sheet":"客户信息","index":3,"n_rows":9,"n_cols":6,"rows_kept":9,"cut":false,"hidden":false,"merged":[[0,0,0,5]]}
["客户信息"]
["序号","客户名称","联系人","联系电话","区域","业务范围"]
["01","深圳鸿达科技有限公司","张三",1001008611,"深圳","耐克春装"]
["02","广州鸿达科技有限公司","李四",1001008612,"广州","耐克夏装"]
["03","上海鸿达科技有限公司","王五",1001008613,"上海","耐克秋装"]
["04","北京鸿达科技有限公司","赵六",1001008614,"北京","耐克冬装"]
["05","厦门鸿达科技有限公司","洪七",1001008615,"厦门","特步春装"]
["06","珠海鸿达科技有限公司","万八",1001008616,"珠海","特步夏装"]
["07","佛山鸿达科技有限公司","汪九",1001008617,"佛山","特步秋装"]

{"sheet":"入库表","index":4,"n_rows":200,"n_cols":11,"rows_kept":200,"cut":false,"hidden":false,"merged":[[0,0,0,10]]}
["入库表"]
["采购日期","货品编码","货品名称","规格型号","颜    色","数    量","单    位","进货单价","金    额","实付金额","欠款金额"]
["2018-02-08","BM001",{"$f":"VLOOKUP(B3,商品信息!A:E,2,0)","v":"HPMC-001"},{"$f":"VLOOKUP(B3,商品信息!A:E,3,0)","v":"GGXH-001"},"红色",192,"件",16,{"$f":"F3*H3","v":3072},1500,{"$f":"I3-J3","v":1572}]
["2018-02-09","BM002",{"$f":"VLOOKUP(B4,商品信息!A:E,2,0)","v":"HPMC-002"},{"$f":"VLOOKUP(B4,商品信息!A:E,3,0)","v":"GGXH-002"},"蓝色",265,"件",25,{"$f":"F4*H4","v":6625},1500,{"$f":"I4-J4","v":5125}]
["2018-02-10","BM003",{"$f":"VLOOKUP(B5,商品信息!A:E,2,0)","v":"HPMC-003"},{"$f":"VLOOKUP(B5,商品信息!A:E,3,0)","v":"GGXH-003"},"黑色",165,"件",36,5940,1500,4440]
["2018-02-11","BM004",{"$f":"VLOOKUP(B6,商品信息!A:E,2,0)","v":"HPMC-004"},{"$f":"VLOOKUP(B6,商品信息!A:E,3,0)","v":"GGXH-004"},"黄色",98,"件",19,1862,1500,362]
["2018-02-12","BM005",{"$f":"VLOOKUP(B7,商品信息!A:E,2,0)","v":"HPMC-005"},{"$f":"VLOOKUP(B7,商品信息!A:E,3,0)","v":"GGXH-005"},"紫色",209,"件",29,6061,1500,4561]
["2018-02-13","BM006",{"$f":"VLOOKUP(B8,商品信息!A:E,2,0)","v":"HPMC-006"},{"$f":"VLOOKUP(B8,商品信息!A:E,3,0)","v":"GGXH-006"},"红色",350,"件",25,8750,1500,7250]
["2018-02-14","BM007",{"$f":"VLOOKUP(B9,商品信息!A:E,2,0)","v":"HPMC-007"},{"$f":"VLOOKUP(B9,商品信息!A:E,3,0)","v":"GGXH-007"},"橙色",189,"件",30,5670,1500,4170]
[null,null,null,null,null,null,null,null,0,null,0]
[null,null,null,null,null,null,null,null,0,null,0]
[null,null,null,null,null,null,null,null,0,null,0]
[null,null,null,null,null,null,null,null,0,null,0]
[null,null,null,null,null,null,null,null,0,null,0]
[null,null,null,null,null,null,null,null,0,null,0]
[null,null,null,null,null,null,null,null,0,null,0]
[null,null,null,null,null,null,null,null,0,null,0]
[null,null,null,null,null,null,null,null,0,null,0]
[null,null,null,null,null,null,null,null,0,null,0]
[null,null,null,null,null,null,null,null,0,null,0]
[null,null,null,null,null,null,null,null,0,null,0]
[null,null,null,null,null,null,null,null,0,null,0]
[null,null,null,null,null,null,null,null,0,null,0]
[null,null,null,null,null,null,null,null,0,null,0]
[null,null,null,null,null,null,null,null,0,null,0]
[null,null,null,null,null,null,null,null,0,null,0]
[null,null,null,null,null,null,null,null,0,null,0]
[null,null,null,null,null,null,null,null,0,null,0]
[null,null,null,null,null,null,null,null,0,null,0]
[null,null,null,null,null,null,null,null,0,null,0]
{"$rows_left_out":171}
{"sheet":"出库表","index":5,"n_rows":200,"n_cols":11,"rows_kept":200,"cut":false,"hidden":false,"merged":[[0,0,0,10]]}
["出库表"]
["销售日期","货品编码","货品名称","规格型号","颜    色","数    量","单    位","销售单价","金    额","实收金额","欠收款金额"]
["2018-02-20","BM001",{"$f":"VLOOKUP(B3,商品信息!A:E,2,0)","v":"HPMC-001"},{"$f":"VLOOKUP(B3,商品信息!A:E,3,0)","v":"GGXH-001"},"红色",65,"件",25,{"$f":"H3*F3","v":1625},100,{"$f":"I3-J3","v":1525}]
["2018-02-21","BM002",{"$f":"VLOOKUP(B4,商品信息!A:E,2,0)","v":"HPMC-002"},{"$f":"VLOOKUP(B4,商品信息!A:E,3,0)","v":"GGXH-002"},"蓝色",192,"件",37,{"$f":"H4*F4","v":7104},100,{"$f":"I4-J4","v":7004}]
["2018-02-22","BM003",{"$f":"VLOOKUP(B5,商品信息!A:E,2,0)","v":"HPMC-003"},{"$f":"VLOOKUP(B5,商品信息!A:E,3,0)","v":"GGXH-003"},"黑色",108,"件",45,4860,100,4760]
["2018-02-23","BM004",{"$f":"VLOOKUP(B6,商品信息!A:E,2,0)","v":"HPMC-004"},{"$f":"VLOOKUP(B6,商品信息!A:E,3,0)","v":"GGXH-004"},"黄色",37,"件",30,1110,100,1010]
["2018-02-24","BM005",{"$f":"VLOOKUP(B7,商品信息!A:E,2,0)","v":"HPMC-005"},{"$f":"VLOOKUP(B7,商品信息!A:E,3,0)","v":"GGXH-005"},"紫色",163,"件",41,6683,100,6583]
["2018-02-25","BM006",{"$f":"VLOOKUP(B8,商品信息!A:E,2,0)","v":"HPMC-006"},{"$f":"VLOOKUP(B8,商品信息!A:E,3,0)","v":"GGXH-006"},"金色",295,"件",53,15635,10000,5635]
["2018-02-26","BM007",{"$f":"VLOOKUP(B9,商品信息!A:E,2,0)","v":"HPMC-007"},{"$f":"VLOOKUP(B9,商品信息!A:E,3,0)","v":"GGXH-007"},"橙色",118,"件",45,5310,1000,4310]
[null,null,null,null,null,null,null,null,0,null,0]
[null,null,null,null,null,null,null,null,0,null,0]
[null,null,null,null,null,null,null,null,0,null,0]
[null,null,null,null,null,null,null,null,0,null,0]
[null,null,null,null,null,null,null,null,0,null,0]
[null,null,null,null,null,null,null,null,0,null,0]
[null,null,null,null,null,null,null,null,0,null,0]
[null,null,null,null,null,null,null,null,0,null,0]
[null,null,null,null,null,null,null,null,0,null,0]
[null,null,null,null,null,null,null,null,0,null,0]
[null,null,null,null,null,null,null,null,0,null,0]
[null,null,null,null,null,null,null,null,0,null,0]
[null,null,null,null,null,null,null,null,0,null,0]
[null,null,null,null,null,null,null,null,0,null,0]
[null,null,null,null,null,null,null,null,0,null,0]
[null,null,null,null,null,null,null,null,0,null,0]
[null,null,null,null,null,null,null,null,0,null,0]
[null,null,null,null,null,null,null,null,0,null,0]
[null,null,null,null,null,null,null,null,0,null,0]
[null,null,null,null,null,null,null,null,0,null,0]
[null,null,null,null,null,null,null,null,0,null,0]
{"$rows_left_out":171}
{"sheet":"库存表","index":6,"n_rows":200,"n_cols":13,"rows_kept":200,"cut":false,"hidden":false,"merged":[[0,0,0,12]]}
["库存表"]
["货品编码","货品名称","规格型号","颜    色","单    位","入库数量","进货单价","金    额","出库数量","销售单价","金    额","库存数量","利润"]
["BM001",{"$f":"VLOOKUP(A3,商品信息!A:E,2,0)","v":"HPMC-001"},{"$f":"VLOOKUP(A3,商品信息!A:E,3,0)","v":"GGXH-001"},"红色","件",{"$f":"VLOOKUP(A3,入库表!B:H,5,0)","v":192},{"$f":"VLOOKUP(A3,入库表!B:H,7,0)","v":16},{"$f":"F3*G3","v":3072},66,{"$f":"VLOOKUP(A3,出库表!B:H,7,0)","v":25},{"$f":"I3*J3","v":1650},{"$f":"F3-I3","v":126},{"$f":"I3*(J3-G3)","v":594}]
["BM002",{"$f":"VLOOKUP(A4,商品信息!A:E,2,0)","v":"HPMC-002"},{"$f":"VLOOKUP(A4,商品信息!A:E,3,0)","v":"GGXH-002"},"蓝色","件",{"$f":"VLOOKUP(A4,入库表!B:H,5,0)","v":265},{"$f":"VLOOKUP(A4,入库表!B:H,7,0)","v":25},6625,{"$f":"VLOOKUP(A4,出库表!B:H,5,0)","v":192},{"$f":"VLOOKUP(A4,出库表!B:H,7,0)","v":37},{"$f":"I4*J4","v":7104},{"$f":"F4-I4","v":73},{"$f":"I4*(J4-G4)","v":2304}]
["BM003",{"$f":"VLOOKUP(A5,商品信息!A:E,2,0)","v":"HPMC-003"},{"$f":"VLOOKUP(A5,商品信息!A:E,3,0)","v":"GGXH-003"},"黑色","件",{"$f":"VLOOKUP(A5,入库表!B:H,5,0)","v":165},{"$f":"VLOOKUP(A5,入库表!B:H,7,0)","v":36},5940,{"$f":"VLOOKUP(A5,出库表!B:H,5,0)","v":108},{"$f":"VLOOKUP(A5,出库表!B:H,7,0)","v":45},4860,57,972]
["BM004",{"$f":"VLOOKUP(A6,商品信息!A:E,2,0)","v":"HPMC-004"},{"$f":"VLOOKUP(A6,商品信息!A:E,3,0)","v":"GGXH-004"},"黄色","件",{"$f":"VLOOKUP(A6,入库表!B:H,5,0)","v":98},{"$f":"VLOOKUP(A6,入库表!B:H,7,0)","v":19},1862,{"$f":"VLOOKUP(A6,出库表!B:H,5,0)","v":37},{"$f":"VLOOKUP(A6,出库表!B:H,7,0)","v":30},1110,61,407]
["BM005",{"$f":"VLOOKUP(A7,商品信息!A:E,2,0)","v":"HPMC-005"},{"$f":"VLOOKUP(A7,商品信息!A:E,3,0)","v":"GGXH-005"},"紫色","件",{"$f":"VLOOKUP(A7,入库表!B:H,5,0)","v":209},{"$f":"VLOOKUP(A7,入库表!B:H,7,0)","v":29},6061,{"$f":"VLOOKUP(A7,出库表!B:H,5,0)","v":163},{"$f":"VLOOKUP(A7,出库表!B:H,7,0)","v":41},6683,46,1956]
["BM006",{"$f":"VLOOKUP(A8,商品信息!A:E,2,0)","v":"HPMC-006"},{"$f":"VLOOKUP(A8,商品信息!A:E,3,0)","v":"GGXH-006"},"红色","件",{"$f":"VLOOKUP(A8,入库表!B:H,5,0)","v":350},{"$f":"VLOOKUP(A8,入库表!B:H,7,0)","v":25},8750,{"$f":"VLOOKUP(A8,出库表!B:H,5,0)","v":295},{"$f":"VLOOKUP(A8,出库表!B:H,7,0)","v":53},15635,55,8260]
["BM007",{"$f":"VLOOKUP(A9,商品信息!A:E,2,0)","v":"HPMC-007"},{"$f":"VLOOKUP(A9,商品信息!A:E,3,0)","v":"GGXH-007"},"橙色","件",{"$f":"VLOOKUP(A9,入库表!B:H,5,0)","v":189},{"$f":"VLOOKUP(A9,入库表!B:H,7,0)","v":30},5670,{"$f":"VLOOKUP(A9,出库表!B:H,5,0)","v":118},{"$f":"VLOOKUP(A9,出库表!B:H,7,0)","v":45},5310,71,1770]
[null,{"$f":"VLOOKUP(A10,商品信息!A:E,2,0)","v":{"$error":"#N/A"}},{"$f":"VLOOKUP(A10,商品信息!A:E,3,0)","v":{"$error":"#N/A"}},null,null,{"$f":"VLOOKUP(A10,入库表!B:H,5,0)","v":{"$error":"#N/A"}},{"$f":"VLOOKUP(A10,入库表!B:H,7,0)","v":{"$error":"#N/A"}},{"$error":"#N/A"},{"$f":"VLOOKUP(A10,出库表!B:H,5,0)","v":{"$error":"#N/A"}},{"$f":"VLOOKUP(A10,出库表!B:H,7,0)","v":{"$error":"#N/A"}},{"$error":"#N/A"},{"$error":"#N/A"},{"$error":"#N/A"}]
[null,{"$f":"VLOOKUP(A11,商品信息!A:E,2,0)","v":{"$error":"#N/A"}},{"$f":"VLOOKUP(A11,商品信息!A:E,3,0)","v":{"$error":"#N/A"}},null,null,{"$f":"VLOOKUP(A11,入库表!B:H,5,0)","v":{"$error":"#N/A"}},{"$f":"VLOOKUP(A11,入库表!B:H,7,0)","v":{"$error":"#N/A"}},{"$error":"#N/A"},{"$f":"VLOOKUP(A11,出库表!B:H,5,0)","v":{"$error":"#N/A"}},{"$f":"VLOOKUP(A11,出库表!B:H,7,0)","v":{"$error":"#N/A"}},{"$error":"#N/A"},{"$error":"#N/A"},{"$error":"#N/A"}]
[null,{"$f":"VLOOKUP(A12,商品信息!A:E,2,0)","v":{"$error":"#N/A"}},{"$f":"VLOOKUP(A12,商品信息!A:E,3,0)","v":{"$error":"#N/A"}},null,null,{"$f":"VLOOKUP(A12,入库表!B:H,5,0)","v":{"$error":"#N/A"}},{"$f":"VLOOKUP(A12,入库表!B:H,7,0)","v":{"$error":"#N/A"}},{"$error":"#N/A"},{"$f":"VLOOKUP(A12,出库表!B:H,5,0)","v":{"$error":"#N/A"}},{"$f":"VLOOKUP(A12,出库表!B:H,7,0)","v":{"$error":"#N/A"}},{"$error":"#N/A"},{"$error":"#N/A"},{"$error":"#N/A"}]
[null,{"$f":"VLOOKUP(A13,商品信息!A:E,2,0)","v":{"$error":"#N/A"}},{"$f":"VLOOKUP(A13,商品信息!A:E,3,0)","v":{"$error":"#N/A"}},null,null,{"$f":"VLOOKUP(A13,入库表!B:H,5,0)","v":{"$error":"#N/A"}},{"$f":"VLOOKUP(A13,入库表!B:H,7,0)","v":{"$error":"#N/A"}},{"$error":"#N/A"},{"$f":"VLOOKUP(A13,出库表!B:H,5,0)","v":{"$error":"#N/A"}},{"$f":"VLOOKUP(A13,出库表!B:H,7,0)","v":{"$error":"#N/A"}},{"$error":"#N/A"},{"$error":"#N/A"},{"$error":"#N/A"}]
[null,{"$f":"VLOOKUP(A14,商品信息!A:E,2,0)","v":{"$error":"#N/A"}},{"$f":"VLOOKUP(A14,商品信息!A:E,3,0)","v":{"$error":"#N/A"}},null,null,{"$f":"VLOOKUP(A14,入库表!B:H,5,0)","v":{"$error":"#N/A"}},{"$f":"VLOOKUP(A14,入库表!B:H,7,0)","v":{"$error":"#N/A"}},{"$error":"#N/A"},{"$f":"VLOOKUP(A14,出库表!B:H,5,0)","v":{"$error":"#N/A"}},{"$f":"VLOOKUP(A14,出库表!B:H,7,0)","v":{"$error":"#N/A"}},{"$error":"#N/A"},{"$error":"#N/A"},{"$error":"#N/A"}]
[null,{"$f":"VLOOKUP(A15,商品信息!A:E,2,0)","v":{"$error":"#N/A"}},{"$f":"VLOOKUP(A15,商品信息!A:E,3,0)","v":{"$error":"#N/A"}},null,null,{"$f":"VLOOKUP(A15,入库表!B:H,5,0)","v":{"$error":"#N/A"}},{"$f":"VLOOKUP(A15,入库表!B:H,7,0)","v":{"$error":"#N/A"}},{"$error":"#N/A"},{"$f":"VLOOKUP(A15,出库表!B:H,5,0)","v":{"$error":"#N/A"}},{"$f":"VLOOKUP(A15,出库表!B:H,7,0)","v":{"$error":"#N/A"}},{"$error":"#N/A"},{"$error":"#N/A"},{"$error":"#N/A"}]
[null,{"$f":"VLOOKUP(A16,商品信息!A:E,2,0)","v":{"$error":"#N/A"}},{"$f":"VLOOKUP(A16,商品信息!A:E,3,0)","v":{"$error":"#N/A"}},null,null,{"$f":"VLOOKUP(A16,入库表!B:H,5,0)","v":{"$error":"#N/A"}},{"$f":"VLOOKUP(A16,入库表!B:H,7,0)","v":{"$error":"#N/A"}},{"$error":"#N/A"},{"$f":"VLOOKUP(A16,出库表!B:H,5,0)","v":{"$error":"#N/A"}},{"$f":"VLOOKUP(A16,出库表!B:H,7,0)","v":{"$error":"#N/A"}},{"$error":"#N/A"},{"$error":"#N/A"},{"$error":"#N/A"}]
[null,{"$f":"VLOOKUP(A17,商品信息!A:E,2,0)","v":{"$error":"#N/A"}},{"$f":"VLOOKUP(A17,商品信息!A:E,3,0)","v":{"$error":"#N/A"}},null,null,{"$f":"VLOOKUP(A17,入库表!B:H,5,0)","v":{"$error":"#N/A"}},{"$f":"VLOOKUP(A17,入库表!B:H,7,0)","v":{"$error":"#N/A"}},{"$error":"#N/A"},{"$f":"VLOOKUP(A17,出库表!B:H,5,0)","v":{"$error":"#N/A"}},{"$f":"VLOOKUP(A17,出库表!B:H,7,0)","v":{"$error":"#N/A"}},{"$error":"#N/A"},{"$error":"#N/A"},{"$error":"#N/A"}]
[null,{"$f":"VLOOKUP(A18,商品信息!A:E,2,0)","v":{"$error":"#N/A"}},{"$f":"VLOOKUP(A18,商品信息!A:E,3,0)","v":{"$error":"#N/A"}},null,null,{"$f":"VLOOKUP(A18,入库表!B:H,5,0)","v":{"$error":"#N/A"}},{"$f":"VLOOKUP(A18,入库表!B:H,7,0)","v":{"$error":"#N/A"}},{"$error":"#N/A"},{"$f":"VLOOKUP(A18,出库表!B:H,5,0)","v":{"$error":"#N/A"}},{"$f":"VLOOKUP(A18,出库表!B:H,7,0)","v":{"$error":"#N/A"}},{"$error":"#N/A"},{"$error":"#N/A"},{"$error":"#N/A"}]
[null,{"$f":"VLOOKUP(A19,商品信息!A:E,2,0)","v":{"$error":"#N/A"}},{"$f":"VLOOKUP(A19,商品信息!A:E,3,0)","v":{"$error":"#N/A"}},null,null,{"$f":"VLOOKUP(A19,入库表!B:H,5,0)","v":{"$error":"#N/A"}},{"$f":"VLOOKUP(A19,入库表!B:H,7,0)","v":{"$error":"#N/A"}},{"$error":"#N/A"},{"$f":"VLOOKUP(A19,出库表!B:H,5,0)","v":{"$error":"#N/A"}},{"$f":"VLOOKUP(A19,出库表!B:H,7,0)","v":{"$error":"#N/A"}},{"$error":"#N/A"},{"$error":"#N/A"},{"$error":"#N/A"}]
[null,{"$f":"VLOOKUP(A20,商品信息!A:E,2,0)","v":{"$error":"#N/A"}},{"$f":"VLOOKUP(A20,商品信息!A:E,3,0)","v":{"$error":"#N/A"}},null,null,{"$f":"VLOOKUP(A20,入库表!B:H,5,0)","v":{"$error":"#N/A"}},{"$f":"VLOOKUP(A20,入库表!B:H,7,0)","v":{"$error":"#N/A"}},{"$error":"#N/A"},{"$f":"VLOOKUP(A20,出库表!B:H,5,0)","v":{"$error":"#N/A"}},{"$f":"VLOOKUP(A20,出库表!B:H,7,0)","v":{"$error":"#N/A"}},{"$error":"#N/A"},{"$error":"#N/A"},{"$error":"#N/A"}]
[null,{"$f":"VLOOKUP(A21,商品信息!A:E,2,0)","v":{"$error":"#N/A"}},{"$f":"VLOOKUP(A21,商品信息!A:E,3,0)","v":{"$error":"#N/A"}},null,null,{"$f":"VLOOKUP(A21,入库表!B:H,5,0)","v":{"$error":"#N/A"}},{"$f":"VLOOKUP(A21,入库表!B:H,7,0)","v":{"$error":"#N/A"}},{"$error":"#N/A"},{"$f":"VLOOKUP(A21,出库表!B:H,5,0)","v":{"$error":"#N/A"}},{"$f":"VLOOKUP(A21,出库表!B:H,7,0)","v":{"$error":"#N/A"}},{"$error":"#N/A"},{"$error":"#N/A"},{"$error":"#N/A"}]
[null,{"$f":"VLOOKUP(A22,商品信息!A:E,2,0)","v":{"$error":"#N/A"}},{"$f":"VLOOKUP(A22,商品信息!A:E,3,0)","v":{"$error":"#N/A"}},null,null,{"$f":"VLOOKUP(A22,入库表!B:H,5,0)","v":{"$error":"#N/A"}},{"$f":"VLOOKUP(A22,入库表!B:H,7,0)","v":{"$error":"#N/A"}},{"$error":"#N/A"},{"$f":"VLOOKUP(A22,出库表!B:H,5,0)","v":{"$error":"#N/A"}},{"$f":"VLOOKUP(A22,出库表!B:H,7,0)","v":{"$error":"#N/A"}},{"$error":"#N/A"},{"$error":"#N/A"},{"$error":"#N/A"}]
[null,{"$f":"VLOOKUP(A23,商品信息!A:E,2,0)","v":{"$error":"#N/A"}},{"$f":"VLOOKUP(A23,商品信息!A:E,3,0)","v":{"$error":"#N/A"}},null,null,{"$f":"VLOOKUP(A23,入库表!B:H,5,0)","v":{"$error":"#N/A"}},{"$f":"VLOOKUP(A23,入库表!B:H,7,0)","v":{"$error":"#N/A"}},{"$error":"#N/A"},{"$f":"VLOOKUP(A23,出库表!B:H,5,0)","v":{"$error":"#N/A"}},{"$f":"VLOOKUP(A23,出库表!B:H,7,0)","v":{"$error":"#N/A"}},{"$error":"#N/A"},{"$error":"#N/A"},{"$error":"#N/A"}]
[null,{"$f":"VLOOKUP(A24,商品信息!A:E,2,0)","v":{"$error":"#N/A"}},{"$f":"VLOOKUP(A24,商品信息!A:E,3,0)","v":{"$error":"#N/A"}},null,null,{"$f":"VLOOKUP(A24,入库表!B:H,5,0)","v":{"$error":"#N/A"}},{"$f":"VLOOKUP(A24,入库表!B:H,7,0)","v":{"$error":"#N/A"}},{"$error":"#N/A"},{"$f":"VLOOKUP(A24,出库表!B:H,5,0)","v":{"$error":"#N/A"}},{"$f":"VLOOKUP(A24,出库表!B:H,7,0)","v":{"$error":"#N/A"}},{"$error":"#N/A"},{"$error":"#N/A"},{"$error":"#N/A"}]
[null,{"$f":"VLOOKUP(A25,商品信息!A:E,2,0)","v":{"$error":"#N/A"}},{"$f":"VLOOKUP(A25,商品信息!A:E,3,0)","v":{"$error":"#N/A"}},null,null,{"$f":"VLOOKUP(A25,入库表!B:H,5,0)","v":{"$error":"#N/A"}},{"$f":"VLOOKUP(A25,入库表!B:H,7,0)","v":{"$error":"#N/A"}},{"$error":"#N/A"},{"$f":"VLOOKUP(A25,出库表!B:H,5,0)","v":{"$error":"#N/A"}},{"$f":"VLOOKUP(A25,出库表!B:H,7,0)","v":{"$error":"#N/A"}},{"$error":"#N/A"},{"$error":"#N/A"},{"$error":"#N/A"}]
[null,{"$f":"VLOOKUP(A26,商品信息!A:E,2,0)","v":{"$error":"#N/A"}},{"$f":"VLOOKUP(A26,商品信息!A:E,3,0)","v":{"$error":"#N/A"}},null,null,{"$f":"VLOOKUP(A26,入库表!B:H,5,0)","v":{"$error":"#N/A"}},{"$f":"VLOOKUP(A26,入库表!B:H,7,0)","v":{"$error":"#N/A"}},{"$error":"#N/A"},{"$f":"VLOOKUP(A26,出库表!B:H,5,0)","v":{"$error":"#N/A"}},{"$f":"VLOOKUP(A26,出库表!B:H,7,0)","v":{"$error":"#N/A"}},{"$error":"#N/A"},{"$error":"#N/A"},{"$error":"#N/A"}]
[null,{"$f":"VLOOKUP(A27,商品信息!A:E,2,0)","v":{"$error":"#N/A"}},{"$f":"VLOOKUP(A27,商品信息!A:E,3,0)","v":{"$error":"#N/A"}},null,null,{"$f":"VLOOKUP(A27,入库表!B:H,5,0)","v":{"$error":"#N/A"}},{"$f":"VLOOKUP(A27,入库表!B:H,7,0)","v":{"$error":"#N/A"}},{"$error":"#N/A"},{"$f":"VLOOKUP(A27,出库表!B:H,5,0)","v":{"$error":"#N/A"}},{"$f":"VLOOKUP(A27,出库表!B:H,7,0)","v":{"$error":"#N/A"}},{"$error":"#N/A"},{"$error":"#N/A"},{"$error":"#N/A"}]
[null,{"$f":"VLOOKUP(A28,商品信息!A:E,2,0)","v":{"$error":"#N/A"}},{"$f":"VLOOKUP(A28,商品信息!A:E,3,0)","v":{"$error":"#N/A"}},null,null,{"$f":"VLOOKUP(A28,入库表!B:H,5,0)","v":{"$error":"#N/A"}},{"$f":"VLOOKUP(A28,入库表!B:H,7,0)","v":{"$error":"#N/A"}},{"$error":"#N/A"},{"$f":"VLOOKUP(A28,出库表!B:H,5,0)","v":{"$error":"#N/A"}},{"$f":"VLOOKUP(A28,出库表!B:H,7,0)","v":{"$error":"#N/A"}},{"$error":"#N/A"},{"$error":"#N/A"},{"$error":"#N/A"}]
[null,{"$f":"VLOOKUP(A29,商品信息!A:E,2,0)","v":{"$error":"#N/A"}},{"$f":"VLOOKUP(A29,商品信息!A:E,3,0)","v":{"$error":"#N/A"}},null,null,{"$f":"VLOOKUP(A29,入库表!B:H,5,0)","v":{"$error":"#N/A"}},{"$f":"VLOOKUP(A29,入库表!B:H,7,0)","v":{"$error":"#N/A"}},{"$error":"#N/A"},{"$f":"VLOOKUP(A29,出库表!B:H,5,0)","v":{"$error":"#N/A"}},{"$f":"VLOOKUP(A29,出库表!B:H,7,0)","v":{"$error":"#N/A"}},{"$error":"#N/A"},{"$error":"#N/A"},{"$error":"#N/A"}]
[null,{"$f":"VLOOKUP(A30,商品信息!A:E,2,0)","v":{"$error":"#N/A"}},{"$f":"VLOOKUP(A30,商品信息!A:E,3,0)","v":{"$error":"#N/A"}},null,null,{"$f":"VLOOKUP(A30,入库表!B:H,5,0)","v":{"$error":"#N/A"}},{"$f":"VLOOKUP(A30,入库表!B:H,7,0)","v":{"$error":"#N/A"}},{"$error":"#N/A"},{"$f":"VLOOKUP(A30,出库表!B:H,5,0)","v":{"$error":"#N/A"}},{"$f":"VLOOKUP(A30,出库表!B:H,7,0)","v":{"$error":"#N/A"}},{"$error":"#N/A"},{"$error":"#N/A"},{"$error":"#N/A"}]
{"$rows_left_out":171}
{"sheet":"出入库单据","index":7,"n_rows":14,"n_cols":17,"rows_kept":14,"cut":false,"hidden":false,"merged":[[0,9,0,16],[1,10,1,14],[12,10,12,14],[13,10,13,12],[13,13,13,14],[13,15,13,16],[0,0,0,7],[1,1,1,5],[12,1,12,5],[13,1,13,3],[13,4,13,5],[13,6,13,7]]}
["入库单",null,null,null,null,null,null,null,null,"出库单"]
["供应商",null,null,null,null,null,"入库日期",null,null,"客户名称",null,null,null,null,null,"送货日期"]
["序号","货品名称","规格型号","单位","数量","单价","金额","备注",null,"序号","货品名称","规格型号","单位","数量","单价","金额","备注"]
[null,"HPMC-001","GGXH-001","件",10,1625,{"$f":"E4*F4","v":16250},null,null,null,"HPMC-001","GGXH-001","件",65,25,{"$f":"O4*N4","v":1625}]
[null,"HPMC-002","GGXH-002","件",100,7104,{"$f":"E5*F5","v":710400},null,null,null,"HPMC-002","GGXH-002","件",192,37,{"$f":"O5*N5","v":7104}]
[null,"HPMC-003","GGXH-003","件",599,4860,2911140,null,null,null,"HPMC-003","GGXH-003","件",108,45,4860]
[null,"HPMC-004","GGXH-004","件",385,1110,427350,null,null,null,"HPMC-004","GGXH-004","件",37,30,1110]
[null,"HPMC-005","GGXH-005","件",59,6683,394297,null,null,null,"HPMC-005","GGXH-005","件",163,41,6683]
[null,"HPMC-006","GGXH-006","件",99,15635,1547865,null,null,null,"HPMC-006","GGXH-006","件",295,53,15635]
[null,"HPMC-007","GGXH-007","件",80,5310,424800,null,null,null,"HPMC-007","GGXH-007","件",118,45,5310]
[null,null,{"$error":"#N/A"},{"$error":"#N/A"}]
[null,null,{"$error":"#N/A"},{"$error":"#N/A"}]
["总计金额大写：",{"$f":"H13","v":6432102},null,null,null,null,"合计：",{"$f":"SUM(G4:G12)","v":6432102},null,"总计金额大写：",{"$f":"Q13","v":42327},null,null,null,null,"合计：",{"$f":"SUM(P4:P12)","v":42327}]
["审核：",null,null,null,"签收：",null,null,null,null,"审核：",null,null,null,"收货单位签收："]

{"sheet":"出入库存查询","index":8,"n_rows":0,"n_cols":0,"rows_kept":0,"cut":false,"hidden":false,"merged":[]}

{"sheet":"应收明细","index":9,"n_rows":9,"n_cols":11,"rows_kept":9,"cut":false,"hidden":false,"merged":[[0,0,0,10]]}
[]
["销售日期","货品编码","货品名称","规格型号","颜    色","数    量","单    位","销售单价","金    额","实收金额","欠收款金额"]
["2018-02-20","BM001",{"$f":"VLOOKUP(B3,商品信息!A:E,2,0)","v":"HPMC-001"},{"$f":"VLOOKUP(B3,商品信息!A:E,3,0)","v":"GGXH-001"},"红色",65,"件",25,{"$f":"H3*F3","v":1625},100,{"$f":"I3-J3","v":1525}]
["2018-02-21","BM002",{"$f":"VLOOKUP(B4,商品信息!A:E,2,0)","v":"HPMC-002"},{"$f":"VLOOKUP(B4,商品信息!A:E,3,0)","v":"GGXH-002"},"蓝色",192,"件",37,{"$f":"H4*F4","v":7104},100,{"$f":"I4-J4","v":7004}]
["2018-02-22","BM003",{"$f":"VLOOKUP(B5,商品信息!A:E,2,0)","v":"HPMC-003"},{"$f":"VLOOKUP(B5,商品信息!A:E,3,0)","v":"GGXH-003"},"黑色",108,"件",45,4860,100,4760]
["2018-02-23","BM004",{"$f":"VLOOKUP(B6,商品信息!A:E,2,0)","v":"HPMC-004"},{"$f":"VLOOKUP(B6,商品信息!A:E,3,0)","v":"GGXH-004"},"黄色",37,"件",30,1110,100,1010]
["2018-02-24","BM005",{"$f":"VLOOKUP(B7,商品信息!A:E,2,0)","v":"HPMC-005"},{"$f":"VLOOKUP(B7,商品信息!A:E,3,0)","v":"GGXH-005"},"紫色",163,"件",41,6683,100,6583]
["2018-02-25","BM006",{"$f":"VLOOKUP(B8,商品信息!A:E,2,0)","v":"HPMC-006"},{"$f":"VLOOKUP(B8,商品信息!A:E,3,0)","v":"GGXH-006"},"金色",295,"件",53,15635,10000,5635]
["2018-02-26","BM007",{"$f":"VLOOKUP(B9,商品信息!A:E,2,0)","v":"HPMC-007"},{"$f":"VLOOKUP(B9,商品信息!A:E,3,0)","v":"GGXH-007"},"橙色",118,"件",45,5310,1000,4310]

{"sheet":"应付明细","index":10,"n_rows":9,"n_cols":11,"rows_kept":9,"cut":false,"hidden":false,"merged":[[0,0,0,10]]}
[]
["采购日期","货品编码","货品名称","规格型号","颜    色","数    量","单    位","进货单价","金    额","实付金额","欠款金额"]
["2018-02-08","BM001",{"$f":"VLOOKUP(B3,商品信息!A:E,2,0)","v":"HPMC-001"},{"$f":"VLOOKUP(B3,商品信息!A:E,3,0)","v":"GGXH-001"},"红色",192,"件",16,{"$f":"F3*H3","v":3072},1500,{"$f":"I3-J3","v":1572}]
["2018-02-09","BM002",{"$f":"VLOOKUP(B4,商品信息!A:E,2,0)","v":"HPMC-002"},{"$f":"VLOOKUP(B4,商品信息!A:E,3,0)","v":"GGXH-002"},"蓝色",265,"件",25,{"$f":"F4*H4","v":6625},1500,{"$f":"I4-J4","v":5125}]
["2018-02-10","BM003",{"$f":"VLOOKUP(B5,商品信息!A:E,2,0)","v":"HPMC-003"},{"$f":"VLOOKUP(B5,商品信息!A:E,3,0)","v":"GGXH-003"},"黑色",165,"件",36,5940,1500,4440]
["2018-02-11","BM004",{"$f":"VLOOKUP(B6,商品信息!A:E,2,0)","v":"HPMC-004"},{"$f":"VLOOKUP(B6,商品信息!A:E,3,0)","v":"GGXH-004"},"黄色",98,"件",19,1862,1500,362]
["2018-02-12","BM005",{"$f":"VLOOKUP(B7,商品信息!A:E,2,0)","v":"HPMC-005"},{"$f":"VLOOKUP(B7,商品信息!A:E,3,0)","v":"GGXH-005"},"紫色",209,"件",29,6061,1500,4561]
["2018-02-13","BM006",{"$f":"VLOOKUP(B8,商品信息!A:E,2,0)","v":"HPMC-006"},{"$f":"VLOOKUP(B8,商品信息!A:E,3,0)","v":"GGXH-006"},"红色",350,"件",25,8750,1500,7250]
["2018-02-14","BM007",{"$f":"VLOOKUP(B9,商品信息!A:E,2,0)","v":"HPMC-007"},{"$f":"VLOOKUP(B9,商品信息!A:E,3,0)","v":"GGXH-007"},"橙色",189,"件",30,5670,1500,4170]

{"sheet":"数据统计","index":11,"n_rows":0,"n_cols":0,"rows_kept":0,"cut":false,"hidden":false,"merged":[]}

{"sheet":"单据库","index":12,"n_rows":1,"n_cols":1,"rows_kept":1,"cut":false,"hidden":false,"merged":[[0,0,0,16],[27,1,27,3],[27,4,27,5],[27,6,27,7],[14,1,14,5],[25,1,25,5],[26,1,26,3],[26,4,26,5],[26,6,26,7],[1,1,1,5],[12,1,12,5],[13,1,13,3],[13,4,13,5],[13,6,13,7]]}
[" 出入库单据"]

{"sheet":"使用说明","index":13,"n_rows":2,"n_cols":1,"rows_kept":2,"cut":false,"hidden":false,"merged":[]}
["使用说明"]
["1.本表由VBA编码制作而成，用户使用本模板时需启动宏，工作簿中带有公式的单元格都已保护，如需更改可以到审阅-取消工作表保护即可，在更改工作表之前请做好备份工作，本工作簿需要用户将基础信息录入进来，为后面的工作表提供基础数据。\n2.出入库表中都带有公式，填写数据后会自动进行计算,填入数据可以双击任意单元格会弹出窗口，在窗口中输入。\n3.库存查询工作表中需要用户进行选择入库、出库或者库存，选完后系统会根据用户填写的日期和商品编码进行查询。\n4.应收应付工作表中只需要点击按钮系统会自动分析出应收应付的明细并且呈现出来。\n5.单击保存单据按钮系统会自动保存出入库的单据。\n6.利润统计表会跟前面的数据自动呈现。"]